DepATs - трансформеры из Gradle-зависимостей

DepATs - трансформеры из Gradle-зависимостей 1.0.0

Нет прав для скачивания
Сообщения
762
Лучшие ответы
25
Реакции
215
RareScrap добавил(а) новый ресурс:

DepATs - подключай моды-зависимости через Gradle, а трансформеры применятся автоматически - Устали переписывать транфмормеры из зависимостей ручками? Тогда этот плагин для вас!

Механизм зависимостей Gradle - шикарная штука! При помощи нее можно подключать сторонние моды в зависимость к вашему проекту всего лишь написал одну строку в build.gradle, а jar-ник и доки к нему докачаются самостоятельно. Красота!

Но к сожалению, если в моде-зависимости используется access transformer'ы, - setupDecompWorkspace не обнаружит их и вам придется вручную создавать файл и копировать туда транформеры из зависимостей.

Плагин DepATs решает эту проблему в 3 шага...
Узнать больше об этом ресурсе...
 
Сообщения
97
Лучшие ответы
6
Реакции
29
Градл фейлит установку декомп-пространства из-за > Could not create task of type 'GetDepATsTask'
 
Сообщения
762
Лучшие ответы
25
Реакции
215
Градл фейлит установку
Давай сюда бидскрипт и вывод команды gradlew setupDecompWorkspace --stacktrace --debug --info >> log.txt + версию градла. Сейчас пофиксим багу. А еще если есть возможность, приложи весь проект архивом.
 
Сообщения
97
Лучшие ответы
6
Реакции
29
build.gradle:
buildscript {
    repositories {
        mavenCentral()
        maven {
            name = "forge"
            url = "http://files.minecraftforge.net/maven"
        }
        maven {
            name = "sonatype"
            url = "https://oss.sonatype.org/content/repositories/snapshots/"
        }
        maven {
            name = "rarescrap"
                url = "https://dl.bintray.com/rarescrap/minecraft"
            }
        }
    dependencies {
        classpath 'net.minecraftforge.gradle:ForgeGradle:1.2-SNAPSHOT'
        classpath 'ru.rarescrap:depATs:1.0.0'
    }
}
FAILURE: Build failed with an exception.

* Where:
Build file 'C:\Users\stflowerg\Desktop\main-workspace\build.gradle' line: 23

* What went wrong:
A problem occurred evaluating root project 'main-workspace'.
Could not create task of type 'GetDepATsTask'.
* Try:
Run with --debug option to get more log output.

* Exception is:
org.gradle.api.GradleScriptException: A problem occurred evaluating root project 'main-workspace'.
at org.gradle.groovy.scripts.internal.DefaultScriptRunnerFactory$ScriptRunnerImpl.run(DefaultScriptRunnerFactory.java:54)
at org.gradle.configuration.DefaultScriptPluginFactory$ScriptPluginImpl.apply(DefaultScriptPluginFactory.java:187)
at org.gradle.configuration.project.BuildScriptProcessor.execute(BuildScriptProcessor.java:39)
at org.gradle.configuration.project.BuildScriptProcessor.execute(BuildScriptProcessor.java:26)
at org.gradle.configuration.project.ConfigureActionsProjectEvaluator.evaluate(ConfigureActionsProjectEvaluator.java:34)
at org.gradle.configuration.project.LifecycleProjectEvaluator.evaluate(LifecycleProjectEvaluator.java:55)
at org.gradle.api.internal.project.AbstractProject.evaluate(AbstractProject.java:470)
at org.gradle.api.internal.project.AbstractProject.evaluate(AbstractProject.java:79)
at org.gradle.configuration.DefaultBuildConfigurer.configure(DefaultBuildConfigurer.java:31)
at org.gradle.initialization.DefaultGradleLauncher.doBuildStages(DefaultGradleLauncher.java:128)
at org.gradle.initialization.DefaultGradleLauncher.doBuild(DefaultGradleLauncher.java:105)
at org.gradle.initialization.DefaultGradleLauncher.run(DefaultGradleLauncher.java:85)
at org.gradle.launcher.exec.InProcessBuildActionExecuter$DefaultBuildController.run(InProcessBuildActionExecuter.java:81)
at org.gradle.launcher.cli.ExecuteBuildAction.run(ExecuteBuildAction.java:33)
at org.gradle.launcher.cli.ExecuteBuildAction.run(ExecuteBuildAction.java:24)
at org.gradle.launcher.exec.InProcessBuildActionExecuter.execute(InProcessBuildActionExecuter.java:39)
at org.gradle.launcher.exec.InProcessBuildActionExecuter.execute(InProcessBuildActionExecuter.java:29)
at org.gradle.launcher.cli.RunBuildAction.run(RunBuildAction.java:50)
at org.gradle.internal.Actions$RunnableActionAdapter.execute(Actions.java:171)
at org.gradle.launcher.cli.CommandLineActionFactory$ParseAndBuildAction.execute(CommandLineActionFactory.java:237)
at org.gradle.launcher.cli.CommandLineActionFactory$ParseAndBuildAction.execute(CommandLineActionFactory.java:210)
at org.gradle.launcher.cli.JavaRuntimeValidationAction.execute(JavaRuntimeValidationAction.java:35)
at org.gradle.launcher.cli.JavaRuntimeValidationAction.execute(JavaRuntimeValidationAction.java:24)
at org.gradle.launcher.cli.CommandLineActionFactory$WithLogging.execute(CommandLineActionFactory.java:206)
at org.gradle.launcher.cli.CommandLineActionFactory$WithLogging.execute(CommandLineActionFactory.java:169)
at org.gradle.launcher.cli.ExceptionReportingAction.execute(ExceptionReportingAction.java:33)
at org.gradle.launcher.cli.ExceptionReportingAction.execute(ExceptionReportingAction.java:22)
at org.gradle.launcher.Main.doAction(Main.java:33)
at org.gradle.launcher.bootstrap.EntryPoint.run(EntryPoint.java:45)
at org.gradle.launcher.bootstrap.ProcessBootstrap.runNoExit(ProcessBootstrap.java:54)
at org.gradle.launcher.bootstrap.ProcessBootstrap.run(ProcessBootstrap.java:35)
at org.gradle.launcher.GradleMain.main(GradleMain.java:23)
at org.gradle.wrapper.BootstrapMainStarter.start(BootstrapMainStarter.java:30)
at org.gradle.wrapper.WrapperExecutor.execute(WrapperExecutor.java:127)
at org.gradle.wrapper.GradleWrapperMain.main(GradleWrapperMain.java:56)
Caused by: org.gradle.api.tasks.TaskInstantiationException: Could not create task of type 'GetDepATsTask'.
at org.gradle.api.internal.project.taskfactory.TaskFactory$1.call(TaskFactory.java:126)
at org.gradle.api.internal.project.taskfactory.TaskFactory$1.call(TaskFactory.java:121)
at org.gradle.api.internal.AbstractTask.injectIntoNewInstance(AbstractTask.java:137)
at org.gradle.api.internal.project.taskfactory.TaskFactory.createTaskObject(TaskFactory.java:121)
at org.gradle.api.internal.project.taskfactory.TaskFactory.createTask(TaskFactory.java:81)
at org.gradle.api.internal.project.taskfactory.AnnotationProcessingTaskFactory.createTask(AnnotationProcessingTaskFactory.java:99)
at org.gradle.api.internal.project.taskfactory.DependencyAutoWireTaskFactory.createTask(DependencyAutoWireTaskFactory.java:39)
at org.gradle.api.internal.tasks.DefaultTaskContainer.create(DefaultTaskContainer.java:52)
at org.gradle.api.internal.tasks.DefaultTaskContainer.create(DefaultTaskContainer.java:83)
at ru.rarescrap.depats.BasePlugin.apply(BasePlugin.java:18)
at ru.rarescrap.depats.BasePlugin.apply(BasePlugin.java:10)
at org.gradle.api.internal.plugins.DefaultPluginContainer.providePlugin(DefaultPluginContainer.java:110)
at org.gradle.api.internal.plugins.DefaultPluginContainer.addPluginInternal(DefaultPluginContainer.java:69)
at org.gradle.api.internal.plugins.DefaultPluginContainer.apply(DefaultPluginContainer.java:35)
at org.gradle.api.internal.plugins.DefaultObjectConfigurationAction.applyPlugin(DefaultObjectConfigurationAction.java:117)
at org.gradle.api.internal.plugins.DefaultObjectConfigurationAction.access$200(DefaultObjectConfigurationAction.java:36)
at org.gradle.api.internal.plugins.DefaultObjectConfigurationAction$3.run(DefaultObjectConfigurationAction.java:85)
at org.gradle.api.internal.plugins.DefaultObjectConfigurationAction.execute(DefaultObjectConfigurationAction.java:130)
at org.gradle.api.internal.project.AbstractPluginAware.apply(AbstractPluginAware.java:41)
at org.gradle.api.Project$apply$0.call(Unknown Source)
at org.gradle.api.internal.project.ProjectScript.apply(ProjectScript.groovy:34)
at org.gradle.api.Script$apply$0.callCurrent(Unknown Source)
at build_4os2tj7lk7ef5c2c8o9pgpjuil.run(C:\Users\stflowerg\Desktop\main-workspace\build.gradle:23)
at org.gradle.groovy.scripts.internal.DefaultScriptRunnerFactory$ScriptRunnerImpl.run(DefaultScriptRunnerFactory.java:52)
... 34 more
Caused by: java.lang.NoSuchMethodError: org.gradle.StartParameter.getShowStacktrace()Lorg/gradle/api/logging/configuration/ShowStacktrace;
at ru.rarescrap.depats.GetDepATsTask.<init>(GetDepATsTask.java:20)
at ru.rarescrap.depats.GetDepATsTask_Decorated.<init>(Unknown Source)
at org.gradle.api.internal.DependencyInjectingInstantiator.newInstance(DependencyInjectingInstantiator.java:48)
at org.gradle.api.internal.ClassGeneratorBackedInstantiator.newInstance(ClassGeneratorBackedInstantiator.java:36)
at org.gradle.api.internal.project.taskfactory.TaskFactory$1.call(TaskFactory.java:124)
... 57 more


BUILD FAILED

Total time: 15.455 secs
23 строка - apply plugin: 'DepATs'
 
Сообщения
762
Лучшие ответы
25
Реакции
215
@NullPointerException ув. тов-щ. Инфы мало. Запости весь build.gradle и дай полный лог команды gradlew setupDecompWorkspace --stacktrace --debug --info >> log.txt + версию градла и версию java. И ничего не урезай!

Я вроде все расписал, а ты мне какой-то обрубок дал.
 
Сверху