Ошибка при компилировании.

Сообщения
42
Лучшие ответы
0
Реакции
2
Версия Minecraft
1.7.10
Ошибка возникает с определёнными исходниками, ставлю другие всё нормально. 5g2wHnt22Ro.jpglSNLz1NSdoM.jpg
Java:
1#################################################
         ForgeGradle 1.2-SNAPSHOT-fb514d3       
  https://github.com/MinecraftForge/ForgeGradle 
#################################################
               Powered by MCP unknown               
             http://modcoderpack.com             
         by: Searge, ProfMobius, Fesh0r,         
         R4wk, ZeuX, IngisKahn, bspkrs           
#################################################
:compileApiJava UP-TO-DATE
:processApiResources UP-TO-DATE
:apiClasses UP-TO-DATE
:sourceMainJava UP-TO-DATE
:compileJava UP-TO-DATE
:processResources UP-TO-DATE
:classes UP-TO-DATE
:jar UP-TO-DATE
:compileTestJava UP-TO-DATE
:processTestResources UP-TO-DATE
:testClasses UP-TO-DATE
:test UP-TO-DATE
:extractMcpData UP-TO-DATE
:getVersionJson
:extractUserDev UP-TO-DATE
:genSrgs SKIPPED
:reobf FAILED

FAILURE: Build failed with an exception.

* What went wrong:
Execution failed for task ':reobf'.
[QUOTE] MALFORMED[/QUOTE]

* Try:
Run with --info or --debug option to get more log output.

* Exception is:
org.gradle.api.tasks.TaskExecutionException: Execution failed for task ':reobf'.
    at org.gradle.api.internal.tasks.execution.ExecuteActionsTaskExecuter.executeActions(ExecuteActionsTaskExecuter.java:69)
    at org.gradle.api.internal.tasks.execution.ExecuteActionsTaskExecuter.execute(ExecuteActionsTaskExecuter.java:46)
    at org.gradle.api.internal.tasks.execution.PostExecutionAnalysisTaskExecuter.execute(PostExecutionAnalysisTaskExecuter.java:35)
    at org.gradle.api.internal.tasks.execution.SkipUpToDateTaskExecuter.execute(SkipUpToDateTaskExecuter.java:64)
    at org.gradle.api.internal.tasks.execution.ValidatingTaskExecuter.execute(ValidatingTaskExecuter.java:58)
    at org.gradle.api.internal.tasks.execution.SkipEmptySourceFilesTaskExecuter.execute(SkipEmptySourceFilesTaskExecuter.java:42)
    at org.gradle.api.internal.tasks.execution.SkipTaskWithNoActionsExecuter.execute(SkipTaskWithNoActionsExecuter.java:52)
    at org.gradle.api.internal.tasks.execution.SkipOnlyIfTaskExecuter.execute(SkipOnlyIfTaskExecuter.java:53)
    at org.gradle.api.internal.tasks.execution.ExecuteAtMostOnceTaskExecuter.execute(ExecuteAtMostOnceTaskExecuter.java:43)
    at org.gradle.api.internal.AbstractTask.executeWithoutThrowingTaskFailure(AbstractTask.java:296)
    at org.gradle.execution.taskgraph.AbstractTaskPlanExecutor$TaskExecutorWorker.executeTask(AbstractTaskPlanExecutor.java:79)
    at org.gradle.execution.taskgraph.AbstractTaskPlanExecutor$TaskExecutorWorker.processTask(AbstractTaskPlanExecutor.java:63)
    at org.gradle.execution.taskgraph.AbstractTaskPlanExecutor$TaskExecutorWorker.run(AbstractTaskPlanExecutor.java:51)
    at org.gradle.execution.taskgraph.DefaultTaskPlanExecutor.process(DefaultTaskPlanExecutor.java:23)
    at org.gradle.execution.taskgraph.DefaultTaskGraphExecuter.execute(DefaultTaskGraphExecuter.java:86)
    at org.gradle.execution.SelectedTaskExecutionAction.execute(SelectedTaskExecutionAction.java:29)
    at org.gradle.execution.DefaultBuildExecuter.execute(DefaultBuildExecuter.java:61)
    at org.gradle.execution.DefaultBuildExecuter.access$200(DefaultBuildExecuter.java:23)
    at org.gradle.execution.DefaultBuildExecuter$2.proceed(DefaultBuildExecuter.java:67)
    at org.gradle.execution.DryRunBuildExecutionAction.execute(DryRunBuildExecutionAction.java:32)
    at org.gradle.execution.DefaultBuildExecuter.execute(DefaultBuildExecuter.java:61)
    at org.gradle.execution.DefaultBuildExecuter.execute(DefaultBuildExecuter.java:54)
    at org.gradle.initialization.DefaultGradleLauncher.doBuildStages(DefaultGradleLauncher.java:148)
    at org.gradle.initialization.DefaultGradleLauncher.doBuild(DefaultGradleLauncher.java:105)
    at org.gradle.initialization.DefaultGradleLauncher.run(DefaultGradleLauncher.java:85)
    at org.gradle.launcher.exec.InProcessBuildActionExecuter$DefaultBuildController.run(InProcessBuildActionExecuter.java:81)
    at org.gradle.launcher.cli.ExecuteBuildAction.run(ExecuteBuildAction.java:33)
    at org.gradle.launcher.cli.ExecuteBuildAction.run(ExecuteBuildAction.java:24)
    at org.gradle.launcher.exec.InProcessBuildActionExecuter.execute(InProcessBuildActionExecuter.java:39)
    at org.gradle.launcher.exec.InProcessBuildActionExecuter.execute(InProcessBuildActionExecuter.java:29)
    at org.gradle.launcher.cli.RunBuildAction.run(RunBuildAction.java:50)
    at org.gradle.internal.Actions$RunnableActionAdapter.execute(Actions.java:171)
    at org.gradle.launcher.cli.CommandLineActionFactory$ParseAndBuildAction.execute(CommandLineActionFactory.java:237)
    at org.gradle.launcher.cli.CommandLineActionFactory$ParseAndBuildAction.execute(CommandLineActionFactory.java:210)
    at org.gradle.launcher.cli.JavaRuntimeValidationAction.execute(JavaRuntimeValidationAction.java:35)
    at org.gradle.launcher.cli.JavaRuntimeValidationAction.execute(JavaRuntimeValidationAction.java:24)
    at org.gradle.launcher.cli.CommandLineActionFactory$WithLogging.execute(CommandLineActionFactory.java:206)
    at org.gradle.launcher.cli.CommandLineActionFactory$WithLogging.execute(CommandLineActionFactory.java:169)
    at org.gradle.launcher.cli.ExceptionReportingAction.execute(ExceptionReportingAction.java:33)
    at org.gradle.launcher.cli.ExceptionReportingAction.execute(ExceptionReportingAction.java:22)
    at org.gradle.launcher.Main.doAction(Main.java:33)
    at org.gradle.launcher.bootstrap.EntryPoint.run(EntryPoint.java:45)
    at org.gradle.launcher.bootstrap.ProcessBootstrap.runNoExit(ProcessBootstrap.java:54)
    at org.gradle.launcher.bootstrap.ProcessBootstrap.run(ProcessBootstrap.java:35)
    at org.gradle.launcher.GradleMain.main(GradleMain.java:23)
    at org.gradle.wrapper.BootstrapMainStarter.start(BootstrapMainStarter.java:30)
    at org.gradle.wrapper.WrapperExecutor.execute(WrapperExecutor.java:127)
    at org.gradle.wrapper.GradleWrapperMain.main(GradleWrapperMain.java:56)
Caused by: java.lang.IllegalArgumentException: MALFORMED
    at net.md_5.specialsource.Jar.collectJarFiles(Jar.java:169)
    at net.md_5.specialsource.Jar.init(Jar.java:229)
    at net.md_5.specialsource.Jar.init(Jar.java:206)
    at net.minecraftforge.gradle.tasks.user.reobf.ObfArtifact.applySpecialSource(ObfArtifact.java:387)
    at net.minecraftforge.gradle.tasks.user.reobf.ObfArtifact.generate(ObfArtifact.java:350)
    at net.minecraftforge.gradle.tasks.user.reobf.ReobfTask.doTask(ReobfTask.java:317)
    at org.gradle.internal.reflect.JavaMethod.invoke(JavaMethod.java:63)
    at org.gradle.api.internal.project.taskfactory.AnnotationProcessingTaskFactory$StandardTaskAction.doExecute(AnnotationProcessingTaskFactory.java:218)
    at org.gradle.api.internal.project.taskfactory.AnnotationProcessingTaskFactory$StandardTaskAction.execute(AnnotationProcessingTaskFactory.java:211)
    at org.gradle.api.internal.project.taskfactory.AnnotationProcessingTaskFactory$StandardTaskAction.execute(AnnotationProcessingTaskFactory.java:200)
    at org.gradle.api.internal.AbstractTask$TaskActionWrapper.execute(AbstractTask.java:570)
    at org.gradle.api.internal.AbstractTask$TaskActionWrapper.execute(AbstractTask.java:553)
    at org.gradle.api.internal.tasks.execution.ExecuteActionsTaskExecuter.executeAction(ExecuteActionsTaskExecuter.java:80)
    at org.gradle.api.internal.tasks.execution.ExecuteActionsTaskExecuter.executeActions(ExecuteActionsTaskExecuter.java:61)
    ... 47 more


BUILD FAILED

Total time: 5.953 secs
 
Сообщения
839
Лучшие ответы
32
Реакции
294
Кирилица в названии файлов. Чекай все ресурсы и названия пакетов и классов
 
Сообщения
12
Лучшие ответы
1
Реакции
1
Ошибка возникает с определёнными исходниками, ставлю другие всё нормально. Посмотреть вложение 6304Посмотреть вложение 6305
Java:
1#################################################
         ForgeGradle 1.2-SNAPSHOT-fb514d3      
  https://github.com/MinecraftForge/ForgeGradle
#################################################
               Powered by MCP unknown              
             http://modcoderpack.com            
         by: Searge, ProfMobius, Fesh0r,        
         R4wk, ZeuX, IngisKahn, bspkrs          
#################################################
:compileApiJava UP-TO-DATE
:processApiResources UP-TO-DATE
:apiClasses UP-TO-DATE
:sourceMainJava UP-TO-DATE
:compileJava UP-TO-DATE
:processResources UP-TO-DATE
:classes UP-TO-DATE
:jar UP-TO-DATE
:compileTestJava UP-TO-DATE
:processTestResources UP-TO-DATE
:testClasses UP-TO-DATE
:test UP-TO-DATE
:extractMcpData UP-TO-DATE
:getVersionJson
:extractUserDev UP-TO-DATE
:genSrgs SKIPPED
:reobf FAILED

FAILURE: Build failed with an exception.

* What went wrong:
Execution failed for task ':reobf'.
[QUOTE] MALFORMED[/QUOTE]

* Try:
Run with --info or --debug option to get more log output.

* Exception is:
org.gradle.api.tasks.TaskExecutionException: Execution failed for task ':reobf'.
    at org.gradle.api.internal.tasks.execution.ExecuteActionsTaskExecuter.executeActions(ExecuteActionsTaskExecuter.java:69)
    at org.gradle.api.internal.tasks.execution.ExecuteActionsTaskExecuter.execute(ExecuteActionsTaskExecuter.java:46)
    at org.gradle.api.internal.tasks.execution.PostExecutionAnalysisTaskExecuter.execute(PostExecutionAnalysisTaskExecuter.java:35)
    at org.gradle.api.internal.tasks.execution.SkipUpToDateTaskExecuter.execute(SkipUpToDateTaskExecuter.java:64)
    at org.gradle.api.internal.tasks.execution.ValidatingTaskExecuter.execute(ValidatingTaskExecuter.java:58)
    at org.gradle.api.internal.tasks.execution.SkipEmptySourceFilesTaskExecuter.execute(SkipEmptySourceFilesTaskExecuter.java:42)
    at org.gradle.api.internal.tasks.execution.SkipTaskWithNoActionsExecuter.execute(SkipTaskWithNoActionsExecuter.java:52)
    at org.gradle.api.internal.tasks.execution.SkipOnlyIfTaskExecuter.execute(SkipOnlyIfTaskExecuter.java:53)
    at org.gradle.api.internal.tasks.execution.ExecuteAtMostOnceTaskExecuter.execute(ExecuteAtMostOnceTaskExecuter.java:43)
    at org.gradle.api.internal.AbstractTask.executeWithoutThrowingTaskFailure(AbstractTask.java:296)
    at org.gradle.execution.taskgraph.AbstractTaskPlanExecutor$TaskExecutorWorker.executeTask(AbstractTaskPlanExecutor.java:79)
    at org.gradle.execution.taskgraph.AbstractTaskPlanExecutor$TaskExecutorWorker.processTask(AbstractTaskPlanExecutor.java:63)
    at org.gradle.execution.taskgraph.AbstractTaskPlanExecutor$TaskExecutorWorker.run(AbstractTaskPlanExecutor.java:51)
    at org.gradle.execution.taskgraph.DefaultTaskPlanExecutor.process(DefaultTaskPlanExecutor.java:23)
    at org.gradle.execution.taskgraph.DefaultTaskGraphExecuter.execute(DefaultTaskGraphExecuter.java:86)
    at org.gradle.execution.SelectedTaskExecutionAction.execute(SelectedTaskExecutionAction.java:29)
    at org.gradle.execution.DefaultBuildExecuter.execute(DefaultBuildExecuter.java:61)
    at org.gradle.execution.DefaultBuildExecuter.access$200(DefaultBuildExecuter.java:23)
    at org.gradle.execution.DefaultBuildExecuter$2.proceed(DefaultBuildExecuter.java:67)
    at org.gradle.execution.DryRunBuildExecutionAction.execute(DryRunBuildExecutionAction.java:32)
    at org.gradle.execution.DefaultBuildExecuter.execute(DefaultBuildExecuter.java:61)
    at org.gradle.execution.DefaultBuildExecuter.execute(DefaultBuildExecuter.java:54)
    at org.gradle.initialization.DefaultGradleLauncher.doBuildStages(DefaultGradleLauncher.java:148)
    at org.gradle.initialization.DefaultGradleLauncher.doBuild(DefaultGradleLauncher.java:105)
    at org.gradle.initialization.DefaultGradleLauncher.run(DefaultGradleLauncher.java:85)
    at org.gradle.launcher.exec.InProcessBuildActionExecuter$DefaultBuildController.run(InProcessBuildActionExecuter.java:81)
    at org.gradle.launcher.cli.ExecuteBuildAction.run(ExecuteBuildAction.java:33)
    at org.gradle.launcher.cli.ExecuteBuildAction.run(ExecuteBuildAction.java:24)
    at org.gradle.launcher.exec.InProcessBuildActionExecuter.execute(InProcessBuildActionExecuter.java:39)
    at org.gradle.launcher.exec.InProcessBuildActionExecuter.execute(InProcessBuildActionExecuter.java:29)
    at org.gradle.launcher.cli.RunBuildAction.run(RunBuildAction.java:50)
    at org.gradle.internal.Actions$RunnableActionAdapter.execute(Actions.java:171)
    at org.gradle.launcher.cli.CommandLineActionFactory$ParseAndBuildAction.execute(CommandLineActionFactory.java:237)
    at org.gradle.launcher.cli.CommandLineActionFactory$ParseAndBuildAction.execute(CommandLineActionFactory.java:210)
    at org.gradle.launcher.cli.JavaRuntimeValidationAction.execute(JavaRuntimeValidationAction.java:35)
    at org.gradle.launcher.cli.JavaRuntimeValidationAction.execute(JavaRuntimeValidationAction.java:24)
    at org.gradle.launcher.cli.CommandLineActionFactory$WithLogging.execute(CommandLineActionFactory.java:206)
    at org.gradle.launcher.cli.CommandLineActionFactory$WithLogging.execute(CommandLineActionFactory.java:169)
    at org.gradle.launcher.cli.ExceptionReportingAction.execute(ExceptionReportingAction.java:33)
    at org.gradle.launcher.cli.ExceptionReportingAction.execute(ExceptionReportingAction.java:22)
    at org.gradle.launcher.Main.doAction(Main.java:33)
    at org.gradle.launcher.bootstrap.EntryPoint.run(EntryPoint.java:45)
    at org.gradle.launcher.bootstrap.ProcessBootstrap.runNoExit(ProcessBootstrap.java:54)
    at org.gradle.launcher.bootstrap.ProcessBootstrap.run(ProcessBootstrap.java:35)
    at org.gradle.launcher.GradleMain.main(GradleMain.java:23)
    at org.gradle.wrapper.BootstrapMainStarter.start(BootstrapMainStarter.java:30)
    at org.gradle.wrapper.WrapperExecutor.execute(WrapperExecutor.java:127)
    at org.gradle.wrapper.GradleWrapperMain.main(GradleWrapperMain.java:56)
Caused by: java.lang.IllegalArgumentException: MALFORMED
    at net.md_5.specialsource.Jar.collectJarFiles(Jar.java:169)
    at net.md_5.specialsource.Jar.init(Jar.java:229)
    at net.md_5.specialsource.Jar.init(Jar.java:206)
    at net.minecraftforge.gradle.tasks.user.reobf.ObfArtifact.applySpecialSource(ObfArtifact.java:387)
    at net.minecraftforge.gradle.tasks.user.reobf.ObfArtifact.generate(ObfArtifact.java:350)
    at net.minecraftforge.gradle.tasks.user.reobf.ReobfTask.doTask(ReobfTask.java:317)
    at org.gradle.internal.reflect.JavaMethod.invoke(JavaMethod.java:63)
    at org.gradle.api.internal.project.taskfactory.AnnotationProcessingTaskFactory$StandardTaskAction.doExecute(AnnotationProcessingTaskFactory.java:218)
    at org.gradle.api.internal.project.taskfactory.AnnotationProcessingTaskFactory$StandardTaskAction.execute(AnnotationProcessingTaskFactory.java:211)
    at org.gradle.api.internal.project.taskfactory.AnnotationProcessingTaskFactory$StandardTaskAction.execute(AnnotationProcessingTaskFactory.java:200)
    at org.gradle.api.internal.AbstractTask$TaskActionWrapper.execute(AbstractTask.java:570)
    at org.gradle.api.internal.AbstractTask$TaskActionWrapper.execute(AbstractTask.java:553)
    at org.gradle.api.internal.tasks.execution.ExecuteActionsTaskExecuter.executeAction(ExecuteActionsTaskExecuter.java:80)
    at org.gradle.api.internal.tasks.execution.ExecuteActionsTaskExecuter.executeActions(ExecuteActionsTaskExecuter.java:61)
    ... 47 more


BUILD FAILED

Total time: 5.953 secs
Удали всё из assets, а после компиляции assets закинешь вручную в архив с модом.
 
Сверху