Делаю всё как в туториале, но в командной строке выдает в конце ошибку
Код:
C:\MMod>gradlew setupDecompWorkspace gradlew eclipse
****************************
Powered By MCP:
http://mcp.ocean-labs.de/
Searge, ProfMobius, Fesh0r,
R4wk, ZeuX, IngisKahn, bspkrs
MCP Data version : unknown
****************************
FAILURE: Build failed with an exception.
* What went wrong:
Task 'gradlew' not found in root project 'MMod'.
* Try:
Run gradlew tasks to get a list of available tasks. Run with --stacktrace option
to get the stack trace. Run with -
-info
or -
-debug
option to get more log output.
BUILD FAILED
Total time: 3.53 secs
C:\MMod>gradlew setupDecompWorkspace
****************************
Powered By MCP:
http://mcp.ocean-labs.de/
Searge, ProfMobius, Fesh0r,
R4wk, ZeuX, IngisKahn, bspkrs
MCP Data version : unknown
****************************
:extractMcpData UP-TO-DATE
:getVersionJson
:extractUserDev UP-TO-DATE
:genSrgs SKIPPED
:extractNatives UP-TO-DATE
:copyNativesLegacy UP-TO-DATE
:getAssetsIndex
:getAssets
:makeStart FAILED
FAILURE: Build failed with an exception.
* What went wrong:
Execution failed for task ':makeStart'.
> Cannot find System Java Compiler. Ensure that you have installed a JDK (not ju
st a JRE) and configured your JAVA_HOME system variable to point to the accordin
g directory.
* Try:
Run with --stacktrace option to get the stack trace. Run with --info or --debug
option to get more log output.
BUILD FAILED
Total time: 8.673 secs
C:\MMod>gradlew eclipse
****************************
Powered By MCP:
http://mcp.ocean-labs.de/
Searge, ProfMobius, Fesh0r,
R4wk, ZeuX, IngisKahn, bspkrs
MCP Data version : unknown
****************************
:eclipseClasspath
:eclipseJdt
:eclipseProject
:eclipse
BUILD SUCCESSFUL
Total time: 8.275 secs
C:\MMod>