[1.7.10]"reobf error MALFORMED" или мод не компилируется

Мод отказывается компилироваться, выдавая ошибку
a245fb5ae86009496b7f479a1525e4e3.png

Пытался компилировать как через JDK 7 так и через JDK8. Ошибка и stacktrace всегда одна. Пытался скомпилировать через eclipse. Майн крашится и stacktrace говорит о MALFORMED
C:\forge1.7.10>gradlew build -stacktrace
****************************
 Powered By MCP:
 http://mcp.ocean-labs.de/
 Searge, ProfMobius, Fesh0r,
 R4wk, ZeuX, IngisKahn, bspkrs
 MCP Data version : unknown
****************************
:compileApiJava UP-TO-DATE
:processApiResources UP-TO-DATE
:apiClasses UP-TO-DATE
:sourceMainJava UP-TO-DATE
:compileJava UP-TO-DATE
:processResources UP-TO-DATE
:classes UP-TO-DATE
:jar UP-TO-DATE
:compileTestJava UP-TO-DATE
:processTestResources UP-TO-DATE
:testClasses UP-TO-DATE
:test UP-TO-DATE
:extractMcpData UP-TO-DATE
:getVersionJson
:extractUserDev UP-TO-DATE
:genSrgs SKIPPED
:reobf FAILED

FAILURE: Build failed with an exception.

* What went wrong:
Execution failed for task ':reobf'.
> MALFORMED

* Try:
Run with --info or --debug option to get more log output.

* Exception is:
org.gradle.api.tasks.TaskExecutionException: Execution failed for task ':reobf'.

        at org.gradle.api.internal.tasks.execution.ExecuteActionsTaskExecuter.ex
ecuteActions(ExecuteActionsTaskExecuter.java:69)
        at org.gradle.api.internal.tasks.execution.ExecuteActionsTaskExecuter.ex
ecute(ExecuteActionsTaskExecuter.java:46)
        at org.gradle.api.internal.tasks.execution.PostExecutionAnalysisTaskExec
uter.execute(PostExecutionAnalysisTaskExecuter.java:35)
        at org.gradle.api.internal.tasks.execution.SkipUpToDateTaskExecuter.exec
ute(SkipUpToDateTaskExecuter.java:64)
        at org.gradle.api.internal.tasks.execution.ValidatingTaskExecuter.execut
e(ValidatingTaskExecuter.java:58)
        at org.gradle.api.internal.tasks.execution.SkipEmptySourceFilesTaskExecu
ter.execute(SkipEmptySourceFilesTaskExecuter.java:42)
        at org.gradle.api.internal.tasks.execution.SkipTaskWithNoActionsExecuter
.execute(SkipTaskWithNoActionsExecuter.java:52)
        at org.gradle.api.internal.tasks.execution.SkipOnlyIfTaskExecuter.execut
e(SkipOnlyIfTaskExecuter.java:53)
        at org.gradle.api.internal.tasks.execution.ExecuteAtMostOnceTaskExecuter
.execute(ExecuteAtMostOnceTaskExecuter.java:43)
        at org.gradle.api.internal.AbstractTask.executeWithoutThrowingTaskFailur
e(AbstractTask.java:296)
        at org.gradle.execution.taskgraph.AbstractTaskPlanExecutor$TaskExecutorW
orker.executeTask(AbstractTaskPlanExecutor.java:79)
        at org.gradle.execution.taskgraph.AbstractTaskPlanExecutor$TaskExecutorW
orker.processTask(AbstractTaskPlanExecutor.java:63)
        at org.gradle.execution.taskgraph.AbstractTaskPlanExecutor$TaskExecutorW
orker.run(AbstractTaskPlanExecutor.java:51)
        at org.gradle.execution.taskgraph.DefaultTaskPlanExecutor.process(Defaul
tTaskPlanExecutor.java:23)
        at org.gradle.execution.taskgraph.DefaultTaskGraphExecuter.execute(Defau
ltTaskGraphExecuter.java:86)
        at org.gradle.execution.SelectedTaskExecutionAction.execute(SelectedTask
ExecutionAction.java:29)
        at org.gradle.execution.DefaultBuildExecuter.execute(DefaultBuildExecute
r.java:61)
        at org.gradle.execution.DefaultBuildExecuter.access$200(DefaultBuildExec
uter.java:23)
        at org.gradle.execution.DefaultBuildExecuter$2.proceed(DefaultBuildExecu
ter.java:67)
        at org.gradle.execution.DryRunBuildExecutionAction.execute(DryRunBuildEx
ecutionAction.java:32)
        at org.gradle.execution.DefaultBuildExecuter.execute(DefaultBuildExecute
r.java:61)
        at org.gradle.execution.DefaultBuildExecuter.execute(DefaultBuildExecute
r.java:54)
        at org.gradle.initialization.DefaultGradleLauncher.doBuildStages(Default
GradleLauncher.java:148)
        at org.gradle.initialization.DefaultGradleLauncher.doBuild(DefaultGradle
Launcher.java:105)
        at org.gradle.initialization.DefaultGradleLauncher.run(DefaultGradleLaun
cher.java:85)
        at org.gradle.launcher.exec.InProcessBuildActionExecuter$DefaultBuildCon
troller.run(InProcessBuildActionExecuter.java:81)
        at org.gradle.launcher.cli.ExecuteBuildAction.run(ExecuteBuildAction.jav
a:33)
        at org.gradle.launcher.cli.ExecuteBuildAction.run(ExecuteBuildAction.jav
a:24)
        at org.gradle.launcher.exec.InProcessBuildActionExecuter.execute(InProce
ssBuildActionExecuter.java:39)
        at org.gradle.launcher.exec.InProcessBuildActionExecuter.execute(InProce
ssBuildActionExecuter.java:29)
        at org.gradle.launcher.cli.RunBuildAction.run(RunBuildAction.java:50)
        at org.gradle.internal.Actions$RunnableActionAdapter.execute(Actions.jav
a:171)
        at org.gradle.launcher.cli.CommandLineActionFactory$ParseAndBuildAction.
execute(CommandLineActionFactory.java:237)
        at org.gradle.launcher.cli.CommandLineActionFactory$ParseAndBuildAction.
execute(CommandLineActionFactory.java:210)
        at org.gradle.launcher.cli.JavaRuntimeValidationAction.execute(JavaRunti
meValidationAction.java:35)
        at org.gradle.launcher.cli.JavaRuntimeValidationAction.execute(JavaRunti
meValidationAction.java:24)
        at org.gradle.launcher.cli.CommandLineActionFactory$WithLogging.execute(
CommandLineActionFactory.java:206)
        at org.gradle.launcher.cli.CommandLineActionFactory$WithLogging.execute(
CommandLineActionFactory.java:169)
        at org.gradle.launcher.cli.ExceptionReportingAction.execute(ExceptionRep
ortingAction.java:33)
        at org.gradle.launcher.cli.ExceptionReportingAction.execute(ExceptionRep
ortingAction.java:22)
        at org.gradle.launcher.Main.doAction(Main.java:33)
        at org.gradle.launcher.bootstrap.EntryPoint.run(EntryPoint.java:45)
        at org.gradle.launcher.bootstrap.ProcessBootstrap.runNoExit(ProcessBoots
trap.java:54)
        at org.gradle.launcher.bootstrap.ProcessBootstrap.run(ProcessBootstrap.j
ava:35)
        at org.gradle.launcher.GradleMain.main(GradleMain.java:23)
        at org.gradle.wrapper.BootstrapMainStarter.start(BootstrapMainStarter.ja
va:30)
        at org.gradle.wrapper.WrapperExecutor.execute(WrapperExecutor.java:127)
        at org.gradle.wrapper.GradleWrapperMain.main(GradleWrapperMain.java:56)
Caused by: java.lang.IllegalArgumentException: MALFORMED
        at net.md_5.specialsource.Jar.collectJarFiles(Jar.java:169)
        at net.md_5.specialsource.Jar.init(Jar.java:229)
        at net.md_5.specialsource.Jar.init(Jar.java:206)
        at net.minecraftforge.gradle.tasks.user.reobf.ObfArtifact.applySpecialSo
urce(ObfArtifact.java:387)
        at net.minecraftforge.gradle.tasks.user.reobf.ObfArtifact.generate(ObfAr
tifact.java:350)
        at net.minecraftforge.gradle.tasks.user.reobf.ReobfTask.doTask(ReobfTask
.java:317)
        at org.gradle.internal.reflect.JavaMethod.invoke(JavaMethod.java:63)
        at org.gradle.api.internal.project.taskfactory.AnnotationProcessingTaskF
actory$StandardTaskAction.doExecute(AnnotationProcessingTaskFactory.java:218)
        at org.gradle.api.internal.project.taskfactory.AnnotationProcessingTaskF
actory$StandardTaskAction.execute(AnnotationProcessingTaskFactory.java:211)
        at org.gradle.api.internal.project.taskfactory.AnnotationProcessingTaskF
actory$StandardTaskAction.execute(AnnotationProcessingTaskFactory.java:200)
        at org.gradle.api.internal.AbstractTask$TaskActionWrapper.execute(Abstra
ctTask.java:570)
        at org.gradle.api.internal.AbstractTask$TaskActionWrapper.execute(Abstra
ctTask.java:553)
        at org.gradle.api.internal.tasks.execution.ExecuteActionsTaskExecuter.ex
ecuteAction(ExecuteActionsTaskExecuter.java:80)
        at org.gradle.api.internal.tasks.execution.ExecuteActionsTaskExecuter.ex
ecuteActions(ExecuteActionsTaskExecuter.java:61)
        ... 47 more


BUILD FAILED

Total time: 10.783 secs

C:\forge1.7.10>
291\unpacked\conf\packaged.exc
13:20:23.951 [DEBUG] [org.gradle.api.Task] 30c3b9785c179d62f576a44fde7b3964 C:\U
sers\coolkuid\.gradle\caches\minecraft\net\minecraftforge\forge\1.7.10-10.13.2.1
291\unpacked\conf\methods.csv
13:20:23.958 [DEBUG] [org.gradle.api.Task] 82a1b606bd90887f5aac4888ec4584a6 C:\U
sers\coolkuid\.gradle\caches\minecraft\net\minecraftforge\forge\1.7.10-10.13.2.1
291\unpacked\conf\fields.csv
13:20:23.962 [DEBUG] [org.gradle.api.Project] Checksums found: 1f41afe2c0d8146da
477598560282400
079880d50eaeba4d61399af0a5814b55
60e0fd4fce6342aa0e47da1a9929a3fa
30c3b9785c179d62f576a44fde7b3964
82a1b606bd90887f5aac4888ec4584a6
13:20:23.967 [DEBUG] [org.gradle.api.Project] Checksums calculated: 1f41afe2c0d8
146da477598560282400
079880d50eaeba4d61399af0a5814b55
60e0fd4fce6342aa0e47da1a9929a3fa
30c3b9785c179d62f576a44fde7b3964
82a1b606bd90887f5aac4888ec4584a6
13:20:23.973 [DEBUG] [org.gradle.api.Project] Resolving: {SRG_DIR}/mcp-notch.srg

13:20:23.977 [DEBUG] [org.gradle.api.Project] Resolved:  C:/Users/coolkuid/.grad
le/caches/minecraft/net/minecraftforge/forge/1.7.10-10.13.2.1291///srgs/mcp-notc
h.srg
13:20:24.011 [DEBUG] [org.gradle.api.Task] 079880d50eaeba4d61399af0a5814b55 C:\U
sers\coolkuid\.gradle\caches\minecraft\net\minecraftforge\forge\1.7.10-10.13.2.1
291\unpacked\conf\packaged.srg
13:20:24.018 [DEBUG] [org.gradle.api.Task] 60e0fd4fce6342aa0e47da1a9929a3fa C:\U
sers\coolkuid\.gradle\caches\minecraft\net\minecraftforge\forge\1.7.10-10.13.2.1
291\unpacked\conf\packaged.exc
13:20:24.026 [DEBUG] [org.gradle.api.Task] 30c3b9785c179d62f576a44fde7b3964 C:\U
sers\coolkuid\.gradle\caches\minecraft\net\minecraftforge\forge\1.7.10-10.13.2.1
291\unpacked\conf\methods.csv
13:20:24.033 [DEBUG] [org.gradle.api.Task] 82a1b606bd90887f5aac4888ec4584a6 C:\U
sers\coolkuid\.gradle\caches\minecraft\net\minecraftforge\forge\1.7.10-10.13.2.1
291\unpacked\conf\fields.csv
13:20:24.037 [DEBUG] [org.gradle.api.Project] Checksums found: 09a68829e06d2e7a0
e45f0281feb6939
079880d50eaeba4d61399af0a5814b55
60e0fd4fce6342aa0e47da1a9929a3fa
30c3b9785c179d62f576a44fde7b3964
82a1b606bd90887f5aac4888ec4584a6
13:20:24.042 [DEBUG] [org.gradle.api.Project] Checksums calculated: 09a68829e06d
2e7a0e45f0281feb6939
079880d50eaeba4d61399af0a5814b55
60e0fd4fce6342aa0e47da1a9929a3fa
30c3b9785c179d62f576a44fde7b3964
82a1b606bd90887f5aac4888ec4584a6
13:20:24.048 [DEBUG] [org.gradle.api.Project] Resolving: {SRG_DIR}/srg-mcp.srg
13:20:24.051 [DEBUG] [org.gradle.api.Project] Resolved:  C:/Users/coolkuid/.grad
le/caches/minecraft/net/minecraftforge/forge/1.7.10-10.13.2.1291///srgs/srg-mcp.
srg
13:20:24.096 [DEBUG] [org.gradle.api.Task] 079880d50eaeba4d61399af0a5814b55 C:\U
sers\coolkuid\.gradle\caches\minecraft\net\minecraftforge\forge\1.7.10-10.13.2.1
291\unpacked\conf\packaged.srg
13:20:24.104 [DEBUG] [org.gradle.api.Task] 60e0fd4fce6342aa0e47da1a9929a3fa C:\U
sers\coolkuid\.gradle\caches\minecraft\net\minecraftforge\forge\1.7.10-10.13.2.1
291\unpacked\conf\packaged.exc
13:20:24.113 [DEBUG] [org.gradle.api.Task] 30c3b9785c179d62f576a44fde7b3964 C:\U
sers\coolkuid\.gradle\caches\minecraft\net\minecraftforge\forge\1.7.10-10.13.2.1
291\unpacked\conf\methods.csv
13:20:24.119 [DEBUG] [org.gradle.api.Task] 82a1b606bd90887f5aac4888ec4584a6 C:\U
sers\coolkuid\.gradle\caches\minecraft\net\minecraftforge\forge\1.7.10-10.13.2.1
291\unpacked\conf\fields.csv
13:20:24.124 [DEBUG] [org.gradle.api.Project] Checksums found: d21be88fbab41e39d
9870ead95a79352
079880d50eaeba4d61399af0a5814b55
60e0fd4fce6342aa0e47da1a9929a3fa
30c3b9785c179d62f576a44fde7b3964
82a1b606bd90887f5aac4888ec4584a6
13:20:24.130 [DEBUG] [org.gradle.api.Project] Checksums calculated: d21be88fbab4
1e39d9870ead95a79352
079880d50eaeba4d61399af0a5814b55
60e0fd4fce6342aa0e47da1a9929a3fa
30c3b9785c179d62f576a44fde7b3964
82a1b606bd90887f5aac4888ec4584a6
13:20:24.135 [DEBUG] [org.gradle.api.Project] Resolving: {SRG_DIR}/mcp-srg.srg
13:20:24.140 [DEBUG] [org.gradle.api.Project] Resolved:  C:/Users/coolkuid/.grad
le/caches/minecraft/net/minecraftforge/forge/1.7.10-10.13.2.1291///srgs/mcp-srg.
srg
13:20:24.183 [DEBUG] [org.gradle.api.Task] 079880d50eaeba4d61399af0a5814b55 C:\U
sers\coolkuid\.gradle\caches\minecraft\net\minecraftforge\forge\1.7.10-10.13.2.1
291\unpacked\conf\packaged.srg
13:20:24.190 [DEBUG] [org.gradle.api.Task] 60e0fd4fce6342aa0e47da1a9929a3fa C:\U
sers\coolkuid\.gradle\caches\minecraft\net\minecraftforge\forge\1.7.10-10.13.2.1
291\unpacked\conf\packaged.exc
13:20:24.198 [DEBUG] [org.gradle.api.Task] 30c3b9785c179d62f576a44fde7b3964 C:\U
sers\coolkuid\.gradle\caches\minecraft\net\minecraftforge\forge\1.7.10-10.13.2.1
291\unpacked\conf\methods.csv
13:20:24.205 [DEBUG] [org.gradle.api.Task] 82a1b606bd90887f5aac4888ec4584a6 C:\U
sers\coolkuid\.gradle\caches\minecraft\net\minecraftforge\forge\1.7.10-10.13.2.1
291\unpacked\conf\fields.csv
13:20:24.210 [DEBUG] [org.gradle.api.Project] Checksums found: 1ff87709ad75a16b4
471ee1d3a85cebf
079880d50eaeba4d61399af0a5814b55
60e0fd4fce6342aa0e47da1a9929a3fa
30c3b9785c179d62f576a44fde7b3964
82a1b606bd90887f5aac4888ec4584a6
13:20:24.215 [DEBUG] [org.gradle.api.Project] Checksums calculated: 1ff87709ad75
a16b4471ee1d3a85cebf
079880d50eaeba4d61399af0a5814b55
60e0fd4fce6342aa0e47da1a9929a3fa
30c3b9785c179d62f576a44fde7b3964
82a1b606bd90887f5aac4888ec4584a6
13:20:24.220 [DEBUG] [org.gradle.api.Project] Resolving: {SRG_DIR}/srg.exc
13:20:24.224 [DEBUG] [org.gradle.api.Project] Resolved:  C:/Users/coolkuid/.grad
le/caches/minecraft/net/minecraftforge/forge/1.7.10-10.13.2.1291///srgs/srg.exc
13:20:24.248 [DEBUG] [org.gradle.api.Task] 079880d50eaeba4d61399af0a5814b55 C:\U
sers\coolkuid\.gradle\caches\minecraft\net\minecraftforge\forge\1.7.10-10.13.2.1
291\unpacked\conf\packaged.srg
13:20:24.255 [DEBUG] [org.gradle.api.Task] 60e0fd4fce6342aa0e47da1a9929a3fa C:\U
sers\coolkuid\.gradle\caches\minecraft\net\minecraftforge\forge\1.7.10-10.13.2.1
291\unpacked\conf\packaged.exc
13:20:24.263 [DEBUG] [org.gradle.api.Task] 30c3b9785c179d62f576a44fde7b3964 C:\U
sers\coolkuid\.gradle\caches\minecraft\net\minecraftforge\forge\1.7.10-10.13.2.1
291\unpacked\conf\methods.csv
13:20:24.270 [DEBUG] [org.gradle.api.Task] 82a1b606bd90887f5aac4888ec4584a6 C:\U
sers\coolkuid\.gradle\caches\minecraft\net\minecraftforge\forge\1.7.10-10.13.2.1
291\unpacked\conf\fields.csv
13:20:24.274 [DEBUG] [org.gradle.api.Project] Checksums found: bbc68d4474bafd52b
b047b75792ffe43
079880d50eaeba4d61399af0a5814b55
60e0fd4fce6342aa0e47da1a9929a3fa
30c3b9785c179d62f576a44fde7b3964
82a1b606bd90887f5aac4888ec4584a6
13:20:24.279 [DEBUG] [org.gradle.api.Project] Checksums calculated: bbc68d4474ba
fd52bb047b75792ffe43
079880d50eaeba4d61399af0a5814b55
60e0fd4fce6342aa0e47da1a9929a3fa
30c3b9785c179d62f576a44fde7b3964
82a1b606bd90887f5aac4888ec4584a6
13:20:24.284 [DEBUG] [org.gradle.api.Project] Resolving: {SRG_DIR}/mcp.exc
13:20:24.288 [DEBUG] [org.gradle.api.Project] Resolved:  C:/Users/coolkuid/.grad
le/caches/minecraft/net/minecraftforge/forge/1.7.10-10.13.2.1291///srgs/mcp.exc
13:20:24.317 [DEBUG] [org.apache.http.impl.conn.PoolingClientConnectionManager]
                                                                               C
onnection manager is shutting down
13:20:24.323 [DEBUG] [org.gradle.api.Task] 079880d50eaeba4d61399af0a5814b55 C:\U
sers\coolkuid\.gradle\caches\minecraft\net\minecraftforge\forge\1.7.10-10.13.2.1
291\unpacked\conf\packaged.srg
13:20:24.323 [DEBUG] [org.apache.http.impl.conn.DefaultClientConnection] Connect
ion 0.0.0.0:2336<->54.230.98.70:443 closed
13:20:24.331 [DEBUG] [org.gradle.api.Task] 60e0fd4fce6342aa0e47da1a9929a3fa C:\U
sers\coolkuid\.gradle\caches\minecraft\net\minecraftforge\forge\1.7.10-10.13.2.1
291\unpacked\conf\packaged.exc
13:20:24.331 [DEBUG] [org.apache.http.impl.conn.DefaultClientConnection] Connect
ion 0.0.0.0:2336<->54.230.98.70:443 closed
13:20:24.340 [DEBUG] [org.apache.http.impl.conn.PoolingClientConnectionManager]
                                                                               C
onnection manager shut down
13:20:24.340 [DEBUG] [org.gradle.api.Task] 30c3b9785c179d62f576a44fde7b3964 C:\U
sers\coolkuid\.gradle\caches\minecraft\net\minecraftforge\forge\1.7.10-10.13.2.1
291\unpacked\conf\methods.csv
13:20:24.349 [DEBUG] [org.gradle.api.Task] 82a1b606bd90887f5aac4888ec4584a6 C:\U
sers\coolkuid\.gradle\caches\minecraft\net\minecraftforge\forge\1.7.10-10.13.2.1
291\unpacked\conf\fields.csv
13:20:24.355 [DEBUG] [org.gradle.api.Project] Checksums found: 8766f22e697786ad5
5c10d4a54149ff5
079880d50eaeba4d61399af0a5814b55
60e0fd4fce6342aa0e47da1a9929a3fa
30c3b9785c179d62f576a44fde7b3964
82a1b606bd90887f5aac4888ec4584a6
13:20:24.360 [DEBUG] [org.gradle.api.Project] Checksums calculated: 8766f22e6977
86ad55c10d4a54149ff5
079880d50eaeba4d61399af0a5814b55
60e0fd4fce6342aa0e47da1a9929a3fa
30c3b9785c179d62f576a44fde7b3964
82a1b606bd90887f5aac4888ec4584a6
13:20:24.364 [INFO] [org.gradle.api.internal.tasks.execution.SkipOnlyIfTaskExecuter                                                                            ]
                                                                               S
kipping task ':genSrgs' as task onlyIf is false.
13:20:24.368 [DEBUG] [org.gradle.api.internal.tasks.execution.ExecuteAtMostOnceTaskExecuter                                                                    ]
                                                                               F
inished executing task ':genSrgs'
13:20:24.371 [LIFECYCLE] [class org.gradle.TaskExecutionLogger] :genSrgs SKIPPED

13:20:24.376 [INFO] [org.gradle.execution.taskgraph.AbstractTaskPlanExecutor] :g
enSrgs (Thread[main,5,main]) completed. Took 0.585 secs.
13:20:24.379 [INFO] [org.gradle.execution.taskgraph.AbstractTaskPlanExecutor] :r
eobf (Thread[main,5,main]) started.
13:20:24.383 [LIFECYCLE] [class org.gradle.TaskExecutionLogger] :reobf
13:20:24.383 [DEBUG] [org.gradle.api.internal.tasks.execution.ExecuteAtMostOnceTaskExecuter                                                                    ]
                                                                               S
tarting to execute task ':reobf'
13:20:24.390 [DEBUG] [org.gradle.api.Project] Resolving: {MC_VERSION}
13:20:24.393 [DEBUG] [org.gradle.api.Project] Resolved:  1.7.10
13:20:24.398 [DEBUG] [org.gradle.api.internal.tasks.execution.SkipUpToDateTaskExecuter                                                                         ]
                                                                               D
etermining if task ':reobf' is up-to-date
13:20:24.406 [INFO] [org.gradle.api.internal.tasks.execution.SkipUpToDateTaskExecuter                                                                          ]
                                                                               E
xecuting task ':reobf' (up-to-date check took 0.004 secs) due to:
  No history is available.
13:20:24.410 [DEBUG] [org.gradle.api.internal.tasks.execution.ExecuteActionsTaskExecuter                                                                       ]
                                                                               E
xecuting actions for task ':reobf'.
13:20:25.227 [DEBUG] [org.gradle.api.internal.tasks.execution.ExecuteAtMostOnceTaskExecuter                                                                    ]
                                                                               F
inished executing task ':reobf'
13:20:25.233 [LIFECYCLE] [class org.gradle.TaskExecutionLogger] :reobf FAILED
13:20:25.242 [INFO] [org.gradle.execution.taskgraph.AbstractTaskPlanExecutor] :r
eobf (Thread[main,5,main]) completed. Took 0.859 secs.
13:20:25.247 [DEBUG] [org.gradle.execution.taskgraph.AbstractTaskPlanExecutor] T
ask worker [Thread[main,5,main]] finished, busy: 9.717 secs, idle: 0.141 secs
13:20:25.260 [ERROR] [org.gradle.BuildExceptionReporter]
13:20:25.264 [ERROR] [org.gradle.BuildExceptionReporter] FAILURE: Build failed w
ith an exception.
13:20:25.269 [ERROR] [org.gradle.BuildExceptionReporter]
13:20:25.273 [ERROR] [org.gradle.BuildExceptionReporter] * What went wrong:
13:20:25.277 [ERROR] [org.gradle.BuildExceptionReporter] Execution failed for ta
sk ':reobf'.
13:20:25.280 [ERROR] [org.gradle.BuildExceptionReporter] > MALFORMED
13:20:25.286 [ERROR] [org.gradle.BuildExceptionReporter]
13:20:25.291 [ERROR] [org.gradle.BuildExceptionReporter] * Try:
13:20:25.296 [ERROR] [org.gradle.BuildExceptionReporter] Run with --stacktrace o
ption to get the stack trace.
13:20:25.303 [LIFECYCLE] [org.gradle.BuildResultLogger]
13:20:25.308 [LIFECYCLE] [org.gradle.BuildResultLogger] BUILD FAILED
13:20:25.312 [LIFECYCLE] [org.gradle.BuildResultLogger]
13:20:25.316 [LIFECYCLE] [org.gradle.BuildResultLogger] Total time: 21.234 secs
13:20:25.322 [DEBUG] [org.gradle.cache.internal.DefaultFileLockManager] Releasin
g lock on buildscript class cache for build file 'C:\forge1.7.10\build.gradle' (
C:\Users\coolkuid\.gradle\caches\2.0\scripts\build_1vq0vr8a0u62rvmkiig3jtadei\Pr
ojectScript\buildscript).
13:20:25.326 [DEBUG] [org.gradle.cache.internal.DefaultFileLockManager] Releasin
g lock on no_buildscript class cache for build file 'C:\forge1.7.10\build.gradle
' (C:\Users\coolkuid\.gradle\caches\2.0\scripts\build_1vq0vr8a0u62rvmkiig3jtadei
\ProjectScript\no_buildscript).
13:20:25.331 [DEBUG] [org.gradle.cache.internal.btree.BTreePersistentIndexedCache                                                                              ]
                                                                               C
losing cache artifact-at-url.bin (C:\Users\coolkuid\.gradle\caches\modules-2\met
adata-2.12\artifact-at-url.bin)
13:20:25.334 [DEBUG] [org.gradle.cache.internal.btree.BTreePersistentIndexedCache                                                                              ]
                                                                               C
losing cache module-metadata.bin (C:\Users\coolkuid\.gradle\caches\modules-2\met
adata-2.12\module-metadata.bin)
13:20:25.337 [DEBUG] [org.gradle.cache.internal.btree.BTreePersistentIndexedCache                                                                              ]
                                                                               C
losing cache module-versions.bin (C:\Users\coolkuid\.gradle\caches\modules-2\met
adata-2.12\module-versions.bin)
13:20:25.340 [DEBUG] [org.gradle.cache.internal.btree.BTreePersistentIndexedCache                                                                              ]
                                                                               C
losing cache artifact-at-repository.bin (C:\Users\coolkuid\.gradle\caches\module
s-2\metadata-2.12\artifact-at-repository.bin)
13:20:25.343 [DEBUG] [org.gradle.cache.internal.DefaultFileLockManager] Releasin
g lock on artifact cache (C:\Users\coolkuid\.gradle\caches\modules-2).
13:20:25.358 [DEBUG] [org.gradle.cache.internal.btree.BTreePersistentIndexedCache                                                                              ]
                                                                               C
losing cache fileHashes.bin (C:\forge1.7.10\.gradle\2.0\taskArtifacts\fileHashes
.bin)
13:20:25.361 [DEBUG] [org.gradle.cache.internal.btree.BTreePersistentIndexedCache                                                                              ]
                                                                               C
losing cache taskArtifacts.bin (C:\forge1.7.10\.gradle\2.0\taskArtifacts\taskArt
ifacts.bin)
13:20:25.363 [DEBUG] [org.gradle.cache.internal.btree.BTreePersistentIndexedCache                                                                              ]
                                                                               C
losing cache fileSnapshots.bin (C:\forge1.7.10\.gradle\2.0\taskArtifacts\fileSna
pshots.bin)
13:20:25.366 [DEBUG] [org.gradle.cache.internal.btree.BTreePersistentIndexedCache                                                                              ]
                                                                               C
losing cache outputFileStates.bin (C:\forge1.7.10\.gradle\2.0\taskArtifacts\outp
utFileStates.bin)
13:20:25.368 [DEBUG] [org.gradle.cache.internal.DefaultFileLockManager] Releasin
g lock on task history cache (C:\forge1.7.10\.gradle\2.0\taskArtifacts).
13:20:25.371 [DEBUG] [org.gradle.api.internal.artifacts.ivyservice.resolveengine.store.CachedStoreFactory                                                      ]
                                                                               R
esolution result cache closed. Cache reads: 0, disk reads: 0 (avg: 0.0 secs, tot
al: 0.0 secs)
13:20:25.374 [DEBUG] [org.gradle.api.internal.artifacts.ivyservice.resolveengine.store.CachedStoreFactory                                                      ]
                                                                               R
esolved configuration cache closed. Cache reads: 0, disk reads: 0 (avg: 0.0 secs
, total: 0.0 secs)
13:20:25.377 [DEBUG] [org.gradle.api.internal.artifacts.ivyservice.resolveengine.store.ResolutionResultsStoreFactory                                           ]
                                                                               D
eleted 2 resolution results binary files in 0.006 secs
13:20:25.379 [DEBUG] [org.gradle.api.internal.artifacts.ivyservice.ivyresolve.memcache.InMemoryCachedRepositoryFactory                                         ]
                                                                               I
n-memory dependency metadata cache closed. Repos cached: 11, cache instances: 5,
 modules served from cache: 16, artifacts: 5

C:\forge1.7.10>
Пытался использовать способ от суда, не помогло. Также пытался использовать способы с англоязычных форумов. Делал это:
Код:
gradlew cleanCache
gradlew setupDevWorkspace
gradlew eclipse

Также не помогло. Использовал последнюю сборку Forge. Ошибка точно такая же.
 
1.Чистишь весь build,собираешь.
2.Делаешь тоже,но без assets
3.Удаляешь русские/китайские символы из кода
 
Dovakin написал(а):
1.Чистишь весь build,собираешь.
2.Делаешь тоже,но без assets
3.Удаляешь русские/китайские символы из кода
Что то из этих методов мне помогло. Скорее всего мешали мои комментарии. Чего им так не взлюбился русский язык?
 
А еще путь к твоей среде не должен иметь русских слов
 
Зачем ты мне лог консоли скинул то?У тебя клиент не видит его?Или ты найти не можешь?Он в build/libs
 
А главный класс мода скинь.Только в следующий раз кидай на pastebin.com
 
Ну что, решения никто не знает?
[merge_posts_bbcode]Добавлено: 08.06.2015 21:31:42[/merge_posts_bbcode]

Проблема решена. Если не использовать русский язык вообще, то мод прекрасно работает.

[merge_posts_bbcode]Добавлено: 08.06.2015 21:47:27[/merge_posts_bbcode]

Вообщем, это чертово апи вообще не хочет работать с папкой assets. Куда бы я её ни сувал. Если добавлю папку уже в скомпилированный мод, игра его не видит, если не добавляю - видит. Походу игра проверяет md5 hash поэтому и не запускает. Может у кого есть идеи?
 
TheCoolKuid написал(а):
Если не использовать русский язык вообще, то мод прекрасно работает.
А ты уверен, что у тебя проект только на UTF-8 кодировке работает?
TheCoolKuid написал(а):
Может у кого есть идеи?
Перепаковать в zip-архив (с нормальной zip-кодировкой) без пакета "META-INF" и добавить твой assets.
[merge_posts_bbcode]Добавлено: 08.06.2015 22:38:11[/merge_posts_bbcode]

А так-же и другие файлы должны быть в кодировке UTF-8, к примеру *.lang файлы.
 
Проект весь в UTF 8. Перепаковал. Как майн не видел мод, так его и не видит. Ужасный геморрой с API.
 
mcmod.info в архиве мода есть? Я один раз собрал мод, в нем не оказалось этого файла, майн мода не видел. Засунул его сам, увидел.
 
Назад
Сверху