Столкнулся я с огромной проблемой. Мод никак не компилится. Однако. Я делаю аддон для таума. И, что нужно прописывать в build.gradle, чтобы он не выдавал подобные ошибки?:
Код:
:compileJava
warning: [options] bootstrap class path not set in conjunction with -source 1.6
/home/fankar/Modding/forge/build/sources/java/mm/init/MMThaumonomicon.java:19: error: package thaumcraft.common.config does not exist
import thaumcraft.common.config.ConfigBlocks;
^
/home/fankar/Modding/forge/build/sources/java/mm/common/MMBlocks/BlockCrystalBlock.java:17: error: package thaumcraft.common.blocks does not exist
import thaumcraft.common.blocks.CustomStepSound;
^
/home/fankar/Modding/forge/build/sources/java/mm/init/MMThaumonomicon.java:59: error: cannot find symbol
cBlocks[i] = new CrucibleRecipe("TB.CrystalBlocks",new ItemStack(MMBlocks.crystalBlock,1,i),new ItemStack(ConfigBlocks.blockCrystal,1,i),new AspectList().add(primals(1)).add(Aspect.EARTH, 2).add(getPrimalForLoop(i), 2));
^
symbol: variable ConfigBlocks
location: class MMThaumonomicon
/home/fankar/Modding/forge/build/sources/java/mm/init/MMThaumonomicon.java:61: error: cannot find symbol
cBlocks[i] = new CrucibleRecipe("TB.CrystalBlocks",new ItemStack(MMBlocks.crystalBlock,1,i),new ItemStack(ConfigBlocks.blockCrystal,1,i),new AspectList().add(primals(1)).add(Aspect.EARTH, 2).add(primals(1)));
^
symbol: variable ConfigBlocks
location: class MMThaumonomicon
/home/fankar/Modding/forge/build/sources/java/mm/init/MMThaumonomicon.java:68: error: cannot find symbol
cTaintedBlocks[i] = new CrucibleRecipe("TB.CrystalBlocks",new ItemStack(MMBlocks.crystalBlock,1,7),new ItemStack(ConfigBlocks.blockCrystal,1,i),new AspectList().add(primals(1)).add(Aspect.EARTH, 2).add(getPrimalForLoop(i), 2).add(Aspect.TAINT, 2));
^
symbol: variable ConfigBlocks
location: class MMThaumonomicon
/home/fankar/Modding/forge/build/sources/java/mm/init/MMThaumonomicon.java:70: error: cannot find symbol
cTaintedBlocks[i] = new CrucibleRecipe("TB.CrystalBlocks",new ItemStack(MMBlocks.crystalBlock,1,7),new ItemStack(ConfigBlocks.blockCrystal,1,i),new AspectList().add(primals(1)).add(Aspect.EARTH, 2).add(primals(1)).add(Aspect.TAINT, 2));
^
symbol: variable ConfigBlocks
location: class MMThaumonomicon
/home/fankar/Modding/forge/build/sources/java/mm/common/MMBlocks/BlockCrystalBlock.java:38: error: cannot find symbol
setStepSound(new CustomStepSound("crystal", 1.0F, 1.0F));
^
symbol: class CustomStepSound
location: class BlockCrystalBlock
Note: Some input files use or override a deprecated API.
Note: Recompile with -Xlint:deprecation for details.
Note: Some input files use unchecked or unsafe operations.
Note: Recompile with -Xlint:unchecked for details.
7 errors
1 warning
:compileJava FAILED
FAILURE: Build failed with an exception.
* What went wrong:
Execution failed for task ':compileJava'.
> Compilation failed; see the compiler error output for details.
* Try:
Run with --stacktrace option to get the stack trace. Run with --info or --debug option to get more log output.
BUILD FAILED
Total time: 20.705 secs