Follow along with the video below to see how to install our site as a web app on your home screen.
Примечание: This feature may not be available in some browsers.
FAILURE: Build failed with an exception.
* What went wrong:
Execution failed for task ':makeStart'.
> Unable to find a javac compiler;
com.sun.tools.javac.Main is not on the classpath.
Perhaps JAVA_HOME does not point to the JDK.
It is currently set to "C:\Program Files\Java\jre1.8.0_181"
* Try:
Run with --stacktrace option to get the stack trace. Run with --info or --debug option to get more log output.
BUILD FAILED
Все же советую тебе не лезть в них пока. Имхо, ты вероятнее всего будешь оставлять тут пост о каждой своей проблеме и это превратиться в спам. Лучше наберить опыта с вещами попроще.нужны миксинсы
[17:23:43] [main/INFO] [GradleStart]: [FG_1.2.1] Doing Classloader hack.
java.lang.NoSuchMethodException: java.lang.ClassLoader.initializePath(java.lang.String)
at java.base/java.lang.Class.getDeclaredMethod(Class.java:2613)
at net.minecraftforge.gradle.GradleStartCommon.hackNatives(Unknown Source)
at GradleStart.main(Unknown Source)
[17:23:43] [main/INFO] [GradleStart]: [FG_1.2.1] Error handling Classloader hack, printing stack trace.
[17:23:43] [main/INFO] [GradleStart]: Loading ForgeGradle 1.2.1 - By Alkalus
[17:23:43] [main/INFO] [GradleStart]: Extra: []
Exception in thread "main" java.lang.ClassCastException: class jdk.internal.loader.ClassLoaders$AppClassLoader cannot be cast to class java.net.URLClassLoader (jdk.internal.loader.ClassLoaders$AppClassLoader and java.net.URLClassLoader are in module java.base of loader 'bootstrap')
at net.minecraftforge.gradle.GradleStartCommon.searchCoremods(Unknown Source)
at net.minecraftforge.gradle.GradleStartCommon.launch(Unknown Source)
at GradleStart.main(Unknown Source)
#################################################
ForgeGradle 1.2-SNAPSHOT-399976c5
https://github.com/AlkCorp/ForgeGradle
#################################################
Powered by MCP unknown
http://modcoderpack.com
by: Searge, ProfMobius, Fesh0r,
R4wk, ZeuX, IngisKahn, bspkrs
#################################################
FAILURE: Build failed with an exception.
* What went wrong:
Task 'genEclipseRuns' not found in root project 'M1.7.10'.
* Try:
Run gradlew tasks to get a list of available tasks. Run with --stacktrace option to get the stack trace. Run with --info or --debug option to get more log output.
BUILD FAILED
Total time: 6.906 secs
Гугли как устанавливать среду. На форуме куча подобных тем.
Вероятнее всего ты юзаешь gradle 2.0, который по дефолту не юзает https. Тебе стоит его обновить до 4.4.1 (версию прописывать вgradle/wrapper/gradle-wrapper.properties). После этого выполни команду заново.
distributionUrl=https\://services.gradle.org/distributions/gradle-4.9-bin.zip