Gradlew.....

Версия Minecraft
1.12.2
683
3
21
Как же надоела эта проблема не понимаю кэш скинул и команда gradlew setupDecompWorkspace eclipse не работает та что уж там даже setupDevWorkspace eclipse не работает!Что делать?
1544635163360.png
 
Попробуй поставить JDK поновее, но не 192 (при этом удалив старое JDK и JRE, перезагрузить компьютер и начать всё сначала установку JDK и Forge), и желательно 191 установить, она у меня стоит.
 
Последнее редактирование:
ЭксПи... Хм... Не знаю. Убедись, что у тебя Антивирус не блокирует возможность установки. Если нету антивируса, убедись что на момент открытия для установки у тебя не стоит максимальная проверка на подозрительность файла (У меня от этого Adobe Flash Player не устанавливался). Можно ещё попробовать запустить от имени администратора. Что-то ещё не знаю.
 
Я имел виду типа это:

Возможно тебе просто не показывается уведомление, если ты поставил самый высокое положение ползунка.
---
или этого:

При самом высоком значении, может что просто не установиться или не устанавливаться.
 
Не знаю я давно не пользовался.
А вот на счёт второго это типа настройка интернета. Типа вроде как через IE в его настройках подобное можно найти.
 
Код:
        at org.gradle.launcher.daemon.server.exec.BuildCommandOnly.execute(Build
CommandOnly.java:36)
        at org.gradle.launcher.daemon.server.api.DaemonCommandExecution.proceed(
DaemonCommandExecution.java:120)
        at org.gradle.launcher.daemon.server.health.HintGCAfterBuild.execute(Hin
tGCAfterBuild.java:41)
        at org.gradle.launcher.daemon.server.api.DaemonCommandExecution.proceed(
DaemonCommandExecution.java:120)
        at org.gradle.launcher.daemon.server.exec.StartBuildOrRespondWithBusy$1.
run(StartBuildOrRespondWithBusy.java:50)
        at org.gradle.launcher.daemon.server.DaemonStateCoordinator$1.run(Daemon
StateCoordinator.java:237)
        at org.gradle.internal.concurrent.ExecutorPolicy$CatchAndRecordFailures.
onExecute(ExecutorPolicy.java:54)
        at org.gradle.internal.concurrent.StoppableExecutorImpl$1.run(StoppableE
xecutorImpl.java:40)
        at java.util.concurrent.ThreadPoolExecutor.runWorker(ThreadPoolExecutor.
java:1142)
        at java.util.concurrent.ThreadPoolExecutor$Worker.run(ThreadPoolExecutor
.java:617)
        at java.lang.Thread.run(Thread.java:745)
Caused by: sun.security.validator.ValidatorException: PKIX path building failed:
 sun.security.provider.certpath.SunCertPathBuilderException: unable to find vali
d certification path to requested target
        at sun.security.validator.PKIXValidator.doBuild(PKIXValidator.java:387)
        at sun.security.validator.PKIXValidator.engineValidate(PKIXValidator.jav
a:292)
        at sun.security.validator.Validator.validate(Validator.java:260)
        at sun.security.ssl.X509TrustManagerImpl.validate(X509TrustManagerImpl.j
ava:324)
        at sun.security.ssl.X509TrustManagerImpl.checkTrusted(X509TrustManagerIm
pl.java:229)
        at sun.security.ssl.X509TrustManagerImpl.checkServerTrusted(X509TrustMan
agerImpl.java:124)
        at sun.security.ssl.ClientHandshaker.serverCertificate(ClientHandshaker.
java:1491)
        ... 91 more
Caused by: sun.security.provider.certpath.SunCertPathBuilderException: unable to
 find valid certification path to requested target
        at sun.security.provider.certpath.SunCertPathBuilder.build(SunCertPathBu
ilder.java:141)
        at sun.security.provider.certpath.SunCertPathBuilder.engineBuild(SunCert
PathBuilder.java:126)
        at java.security.cert.CertPathBuilder.build(CertPathBuilder.java:280)
        at sun.security.validator.PKIXValidator.doBuild(PKIXValidator.java:382)
        ... 97 more
javax.net.ssl.SSLHandshakeException: sun.security.validator.ValidatorException:
PKIX path building failed: sun.security.provider.certpath.SunCertPathBuilderExce
ption: unable to find valid certification path to requested target
        at sun.security.ssl.Alerts.getSSLException(Alerts.java:192)
        at sun.security.ssl.SSLSocketImpl.fatal(SSLSocketImpl.java:1949)
        at sun.security.ssl.Handshaker.fatalSE(Handshaker.java:302)
        at sun.security.ssl.Handshaker.fatalSE(Handshaker.java:296)
        at sun.security.ssl.ClientHandshaker.serverCertificate(ClientHandshaker.
java:1509)
        at sun.security.ssl.ClientHandshaker.processMessage(ClientHandshaker.jav
a:216)
        at sun.security.ssl.Handshaker.processLoop(Handshaker.java:979)
        at sun.security.ssl.Handshaker.process_record(Handshaker.java:914)
        at sun.security.ssl.SSLSocketImpl.readRecord(SSLSocketImpl.java:1062)
        at sun.security.ssl.SSLSocketImpl.performInitialHandshake(SSLSocketImpl.
java:1375)
        at sun.security.ssl.SSLSocketImpl.startHandshake(SSLSocketImpl.java:1403
)
        at sun.security.ssl.SSLSocketImpl.startHandshake(SSLSocketImpl.java:1387
)
        at sun.net.www.protocol.https.HttpsClient.afterConnect(HttpsClient.java:
559)
        at sun.net.www.protocol.https.AbstractDelegateHttpsURLConnection.connect
(AbstractDelegateHttpsURLConnection.java:185)
        at sun.net.www.protocol.https.HttpsURLConnectionImpl.connect(HttpsURLCon
nectionImpl.java:153)
        at net.minecraftforge.gradle.common.BasePlugin.getWithEtag(BasePlugin.ja
va:723)
        at net.minecraftforge.gradle.common.BasePlugin.getWithEtag(BasePlugin.ja
va:684)
        at net.minecraftforge.gradle.user.patcherUser.forge.ForgePlugin.setForge
VersionJson(ForgePlugin.java:159)
        at net.minecraftforge.gradle.user.patcherUser.forge.ForgePlugin.applyUse
rPlugin(ForgePlugin.java:56)
        at net.minecraftforge.gradle.user.UserBasePlugin.applyPlugin(UserBasePlu
gin.java:171)
        at net.minecraftforge.gradle.common.BasePlugin.apply(BasePlugin.java:214
)
        at net.minecraftforge.gradle.common.BasePlugin.apply(BasePlugin.java:91)

        at org.gradle.api.internal.plugins.ImperativeOnlyPluginApplicator.applyI
mperative(ImperativeOnlyPluginApplicator.java:35)
        at org.gradle.api.internal.plugins.RuleBasedPluginApplicator.applyImpera
tive(RuleBasedPluginApplicator.java:43)
        at org.gradle.api.internal.plugins.DefaultPluginManager.doApply(DefaultP
luginManager.java:137)
        at org.gradle.api.internal.plugins.DefaultPluginManager.apply(DefaultPlu
ginManager.java:112)
        at org.gradle.api.internal.plugins.DefaultObjectConfigurationAction.appl
yType(DefaultObjectConfigurationAction.java:113)
        at org.gradle.api.internal.plugins.DefaultObjectConfigurationAction.acce
ss$200(DefaultObjectConfigurationAction.java:36)
        at org.gradle.api.internal.plugins.DefaultObjectConfigurationAction$3.ru
n(DefaultObjectConfigurationAction.java:80)
        at org.gradle.api.internal.plugins.DefaultObjectConfigurationAction.exec
ute(DefaultObjectConfigurationAction.java:136)
        at org.gradle.api.internal.project.AbstractPluginAware.apply(AbstractPlu
ginAware.java:46)
        at org.gradle.api.internal.project.ProjectScript.apply(ProjectScript.jav
a:34)
        at org.gradle.api.Script$apply$0.callCurrent(Unknown Source)
        at org.codehaus.groovy.runtime.callsite.CallSiteArray.defaultCallCurrent
(CallSiteArray.java:52)
        at org.codehaus.groovy.runtime.callsite.AbstractCallSite.callCurrent(Abs
tractCallSite.java:154)
        at org.codehaus.groovy.runtime.callsite.AbstractCallSite.callCurrent(Abs
tractCallSite.java:166)
        at build_1vbswwxr0jdxhikwxuibcrbi.run(C:\Mods\build.gradle:10)
        at org.gradle.groovy.scripts.internal.DefaultScriptRunnerFactory$ScriptR
unnerImpl.run(DefaultScriptRunnerFactory.java:91)
        at org.gradle.configuration.DefaultScriptPluginFactory$ScriptPluginImpl$
2.run(DefaultScriptPluginFactory.java:177)
        at org.gradle.configuration.ProjectScriptTarget.addConfiguration(Project
ScriptTarget.java:77)
        at org.gradle.configuration.DefaultScriptPluginFactory$ScriptPluginImpl.
apply(DefaultScriptPluginFactory.java:182)
        at org.gradle.configuration.project.BuildScriptProcessor.execute(BuildSc
riptProcessor.java:38)
        at org.gradle.configuration.project.BuildScriptProcessor.execute(BuildSc
riptProcessor.java:25)
        at org.gradle.configuration.project.ConfigureActionsProjectEvaluator.eva
luate(ConfigureActionsProjectEvaluator.java:34)
        at org.gradle.configuration.project.LifecycleProjectEvaluator.evaluate(L
ifecycleProjectEvaluator.java:55)
        at org.gradle.api.internal.project.AbstractProject.evaluate(AbstractProj
ect.java:540)
        at org.gradle.api.internal.project.AbstractProject.evaluate(AbstractProj
ect.java:93)
        at org.gradle.execution.TaskPathProjectEvaluator.configureHierarchy(Task
PathProjectEvaluator.java:42)
        at org.gradle.configuration.DefaultBuildConfigurer.configure(DefaultBuil
dConfigurer.java:35)
        at org.gradle.initialization.DefaultGradleLauncher$2.run(DefaultGradleLa
uncher.java:124)
        at org.gradle.internal.Factories$1.create(Factories.java:22)
        at org.gradle.internal.progress.DefaultBuildOperationExecutor.run(Defaul
tBuildOperationExecutor.java:91)
        at org.gradle.internal.progress.DefaultBuildOperationExecutor.run(Defaul
tBuildOperationExecutor.java:53)
        at org.gradle.initialization.DefaultGradleLauncher.doBuildStages(Default
GradleLauncher.java:121)
        at org.gradle.initialization.DefaultGradleLauncher.access$200(DefaultGra
dleLauncher.java:32)
        at org.gradle.initialization.DefaultGradleLauncher$1.create(DefaultGradl
eLauncher.java:98)
        at org.gradle.initialization.DefaultGradleLauncher$1.create(DefaultGradl
eLauncher.java:92)
        at org.gradle.internal.progress.DefaultBuildOperationExecutor.run(Defaul
tBuildOperationExecutor.java:91)
        at org.gradle.internal.progress.DefaultBuildOperationExecutor.run(Defaul
tBuildOperationExecutor.java:63)
        at org.gradle.initialization.DefaultGradleLauncher.doBuild(DefaultGradle
Launcher.java:92)
        at org.gradle.initialization.DefaultGradleLauncher.run(DefaultGradleLaun
cher.java:83)
        at org.gradle.launcher.exec.InProcessBuildActionExecuter$DefaultBuildCon
troller.run(InProcessBuildActionExecuter.java:99)
        at org.gradle.tooling.internal.provider.ExecuteBuildActionRunner.run(Exe
cuteBuildActionRunner.java:28)
        at org.gradle.launcher.exec.ChainingBuildActionRunner.run(ChainingBuildA
ctionRunner.java:35)
        at org.gradle.launcher.exec.InProcessBuildActionExecuter.execute(InProce
ssBuildActionExecuter.java:48)
        at org.gradle.launcher.exec.InProcessBuildActionExecuter.execute(InProce
ssBuildActionExecuter.java:30)
        at org.gradle.launcher.exec.ContinuousBuildActionExecuter.execute(Contin
uousBuildActionExecuter.java:81)
        at org.gradle.launcher.exec.ContinuousBuildActionExecuter.execute(Contin
uousBuildActionExecuter.java:46)
        at org.gradle.launcher.daemon.server.exec.ExecuteBuild.doBuild(ExecuteBu
ild.java:52)
        at org.gradle.launcher.daemon.server.exec.BuildCommandOnly.execute(Build
CommandOnly.java:36)
        at org.gradle.launcher.daemon.server.api.DaemonCommandExecution.proceed(
DaemonCommandExecution.java:120)
        at org.gradle.launcher.daemon.server.exec.WatchForDisconnection.execute(
WatchForDisconnection.java:37)
        at org.gradle.launcher.daemon.server.api.DaemonCommandExecution.proceed(
DaemonCommandExecution.java:120)
        at org.gradle.launcher.daemon.server.exec.ResetDeprecationLogger.execute
(ResetDeprecationLogger.java:26)
        at org.gradle.launcher.daemon.server.api.DaemonCommandExecution.proceed(
DaemonCommandExecution.java:120)
        at org.gradle.launcher.daemon.server.exec.RequestStopIfSingleUsedDaemon.
execute(RequestStopIfSingleUsedDaemon.java:34)
        at org.gradle.launcher.daemon.server.api.DaemonCommandExecution.proceed(
DaemonCommandExecution.java:120)
        at org.gradle.launcher.daemon.server.exec.ForwardClientInput$2.call(Forw
ardClientInput.java:74)
        at org.gradle.launcher.daemon.server.exec.ForwardClientInput$2.call(Forw
ardClientInput.java:72)
        at org.gradle.util.Swapper.swap(Swapper.java:38)
        at org.gradle.launcher.daemon.server.exec.ForwardClientInput.execute(For
wardClientInput.java:72)
        at org.gradle.launcher.daemon.server.api.DaemonCommandExecution.proceed(
DaemonCommandExecution.java:120)
        at org.gradle.launcher.daemon.server.health.DaemonHealthTracker.execute(
DaemonHealthTracker.java:40)
        at org.gradle.launcher.daemon.server.api.DaemonCommandExecution.proceed(
DaemonCommandExecution.java:120)
        at org.gradle.launcher.daemon.server.exec.LogToClient.doBuild(LogToClien
t.java:60)
        at org.gradle.launcher.daemon.server.exec.BuildCommandOnly.execute(Build
CommandOnly.java:36)
        at org.gradle.launcher.daemon.server.api.DaemonCommandExecution.proceed(
DaemonCommandExecution.java:120)
        at org.gradle.launcher.daemon.server.exec.EstablishBuildEnvironment.doBu
ild(EstablishBuildEnvironment.java:72)
        at org.gradle.launcher.daemon.server.exec.BuildCommandOnly.execute(Build
CommandOnly.java:36)
        at org.gradle.launcher.daemon.server.api.DaemonCommandExecution.proceed(
DaemonCommandExecution.java:120)
        at org.gradle.launcher.daemon.server.health.HintGCAfterBuild.execute(Hin
tGCAfterBuild.java:41)
        at org.gradle.launcher.daemon.server.api.DaemonCommandExecution.proceed(
DaemonCommandExecution.java:120)
        at org.gradle.launcher.daemon.server.exec.StartBuildOrRespondWithBusy$1.
run(StartBuildOrRespondWithBusy.java:50)
        at org.gradle.launcher.daemon.server.DaemonStateCoordinator$1.run(Daemon
StateCoordinator.java:237)
        at org.gradle.internal.concurrent.ExecutorPolicy$CatchAndRecordFailures.
onExecute(ExecutorPolicy.java:54)
        at org.gradle.internal.concurrent.StoppableExecutorImpl$1.run(StoppableE
xecutorImpl.java:40)
        at java.util.concurrent.ThreadPoolExecutor.runWorker(ThreadPoolExecutor.
java:1142)
        at java.util.concurrent.ThreadPoolExecutor$Worker.run(ThreadPoolExecutor
.java:617)
        at java.lang.Thread.run(Thread.java:745)
Caused by: sun.security.validator.ValidatorException: PKIX path building failed:
 sun.security.provider.certpath.SunCertPathBuilderException: unable to find vali
d certification path to requested target
        at sun.security.validator.PKIXValidator.doBuild(PKIXValidator.java:387)
        at sun.security.validator.PKIXValidator.engineValidate(PKIXValidator.jav
a:292)
        at sun.security.validator.Validator.validate(Validator.java:260)
        at sun.security.ssl.X509TrustManagerImpl.validate(X509TrustManagerImpl.j
ava:324)
        at sun.security.ssl.X509TrustManagerImpl.checkTrusted(X509TrustManagerIm
pl.java:229)
        at sun.security.ssl.X509TrustManagerImpl.checkServerTrusted(X509TrustMan
agerImpl.java:124)
        at sun.security.ssl.ClientHandshaker.serverCertificate(ClientHandshaker.
java:1491)
        ... 94 more
Caused by: sun.security.provider.certpath.SunCertPathBuilderException: unable to
 find valid certification path to requested target
        at sun.security.provider.certpath.SunCertPathBuilder.build(SunCertPathBu
ilder.java:141)
        at sun.security.provider.certpath.SunCertPathBuilder.engineBuild(SunCert
PathBuilder.java:126)
        at java.security.cert.CertPathBuilder.build(CertPathBuilder.java:280)
        at sun.security.validator.PKIXValidator.doBuild(PKIXValidator.java:382)
        ... 100 more
This mapping 'snapshot_20171003' was designed for MC 1.12! Use at your own peril
.
#################################################
         ForgeGradle 2.3-SNAPSHOT-3996470
  https://github.com/MinecraftForge/ForgeGradle
#################################################
                 Powered by MCP
             http://modcoderpack.com
     by: Searge, ProfMobius, R4wk, ZeuX
     Fesh0r, IngisKahn, bspkrs, LexManos
#################################################
:deobfCompileDummyTask
:deobfProvidedDummyTask
:getVersionJson
:extractUserdev

FAILURE: Build failed with an exception.

* What went wrong:
Could not resolve all dependencies for configuration ':forgeGradleUserDevPackage
'.
> Could not download forge-userdev.jar (net.minecraftforge:forge:1.12.2-14.23.5.
2768)
   > Could not get resource 'https://files.minecraftforge.net/maven/net/minecraf
tforge/forge/1.12.2-14.23.5.2768/forge-1.12.2-14.23.5.2768-userdev.jar'.
      > Could not HEAD 'https://files.minecraftforge.net/maven/net/minecraftforg
e/forge/1.12.2-14.23.5.2768/forge-1.12.2-14.23.5.2768-userdev.jar'.
         > sun.security.validator.ValidatorException: PKIX path building failed:
 sun.security.provider.certpath.SunCertPathBuilderException: unable to find vali
d certification path to requested target

* Try:
Run with --stacktrace option to get the stack trace. Run with --info or --debug
option to get more log output.

BUILD FAILED

Total time: 11.016 secs

C:\Mods>
 
Назад
Сверху