Ошибка билда Gradle

Версия Minecraft
1.16.5
API
Forge
Решил попробовать сбилдить я соурс мода Waystones 1 16 5.
При изначально билде мне сказали что версия gradle не подоходит ( моя была 7.4.2 ). Сменив ее на 5.6.4 начало выбивать это.
Если кто знает в чем проблема буду благодарен за помощь.1654214689893.png
 
Краш-лог
03:06:07.912 [ERROR] [org.gradle.internal.buildevents.BuildExceptionReporter]
03:06:07.913 [ERROR] [org.gradle.internal.buildevents.BuildExceptionReporter] FAILURE: Build failed with an exception.
03:06:07.913 [ERROR] [org.gradle.internal.buildevents.BuildExceptionReporter]
03:06:07.913 [ERROR] [org.gradle.internal.buildevents.BuildExceptionReporter] * What went wrong:
03:06:07.914 [ERROR] [org.gradle.internal.buildevents.BuildExceptionReporter] Execution failed for task ':addMixinsToJar'.
03:06:07.914 [ERROR] [org.gradle.internal.buildevents.BuildExceptionReporter] > Gradle 5 was detected but the mixin dependency was missing from one or more Annotation Processor configurations: [annotationProcessor].
To enable the Mixin AP please include the mixin processor artefact in each Annotation Processor configuration. For example if you are using mixin dependency 'org.spongepowered:mixin:0.8.2' you should specify: depend
encies { annotationProcessor 'org.spongepowered:mixin:0.8.2:processor' }. If you believe you are seeing this message in error, you can disable this check via by adding disableAnnotationProcessorCheck() to your mixin
{ } block.
03:06:07.914 [ERROR] [org.gradle.internal.buildevents.BuildExceptionReporter]
03:06:07.915 [ERROR] [org.gradle.internal.buildevents.BuildExceptionReporter] * Try:
03:06:07.915 [ERROR] [org.gradle.internal.buildevents.BuildExceptionReporter] Run with --stacktrace option to get the stack trace. Run with --scan to get full insights.
03:06:07.916 [ERROR] [org.gradle.internal.buildevents.BuildExceptionReporter]
03:06:07.916 [ERROR] [org.gradle.internal.buildevents.BuildExceptionReporter] * Get more help at https://help.gradle.org
03:06:07.916 [ERROR] [org.gradle.internal.buildevents.BuildResultLogger]
03:06:07.917 [ERROR] [org.gradle.internal.buildevents.BuildResultLogger] BUILD FAILED in 17s
Краш-лог:
03:06:07.912 [ERROR] [org.gradle.internal.buildevents.BuildExceptionReporter]
03:06:07.913 [ERROR] [org.gradle.internal.buildevents.BuildExceptionReporter] FAILURE: Build failed with an exception.
03:06:07.913 [ERROR] [org.gradle.internal.buildevents.BuildExceptionReporter]
03:06:07.913 [ERROR] [org.gradle.internal.buildevents.BuildExceptionReporter] * What went wrong:
03:06:07.914 [ERROR] [org.gradle.internal.buildevents.BuildExceptionReporter] Execution failed for task ':addMixinsToJar'.
03:06:07.914 [ERROR] [org.gradle.internal.buildevents.BuildExceptionReporter] > Gradle 5  was detected but the mixin dependency was missing from one or more Annotation Processor configurations: [annotationProcessor].
 To enable the Mixin AP please include the mixin processor artefact in each Annotation Processor configuration. For example if you are using mixin dependency 'org.spongepowered:mixin:0.8.2' you should specify: depend
encies { annotationProcessor 'org.spongepowered:mixin:0.8.2:processor' }. If you believe you are seeing this message in error, you can disable this check via by adding disableAnnotationProcessorCheck() to your mixin
{ } block.
03:06:07.914 [ERROR] [org.gradle.internal.buildevents.BuildExceptionReporter]
03:06:07.915 [ERROR] [org.gradle.internal.buildevents.BuildExceptionReporter] * Try:
03:06:07.915 [ERROR] [org.gradle.internal.buildevents.BuildExceptionReporter] Run with --stacktrace option to get the stack trace.  Run with --scan to get full insights.
03:06:07.916 [ERROR] [org.gradle.internal.buildevents.BuildExceptionReporter]
03:06:07.916 [ERROR] [org.gradle.internal.buildevents.BuildExceptionReporter] * Get more help at https://help.gradle.org
03:06:07.916 [ERROR] [org.gradle.internal.buildevents.BuildResultLogger]
03:06:07.917 [ERROR] [org.gradle.internal.buildevents.BuildResultLogger] BUILD FAILED in 17s
Назад
Сверху