ошибка FAILURE: Build failed with an exception. при вводе команды setupDecompWorkspace

Версия Minecraft
1.12.2
2
1
ошибка FAILURE: Build failed with an exception. при вводе команды setupDecompWorkspace
вот всё что выдала командная строка
C:\Users\kskul>cd C:\Minecraft Moding\Barotium Mod

C:\Minecraft Moding\Barotium Mod>gradlew setupDecompWorkspace
To honour the JVM settings for this build a new JVM will be forked. Please consider using the daemon: The Gradle Daemon - Gradle User Manual.
Daemon will be stopped at the end of the build stopping after processing

New Dep: net.minecraftforge:forge:1.12.2-14.23.5.2854_mapped_snapshot_20171003-1.12

FAILURE: Build failed with an exception.

* What went wrong:
Task 'setupDecompWorkspace' not found in root project 'Barotium Mod'.

* Try:
Run gradlew tasks to get a list of available tasks. Run with --stacktrace option to get the stack trace. Run with --info or --debug option to get more log output. Run with --scan to get full insights.

* Get more help at Gradle | Search for Help with Gradle

Deprecated Gradle features were used in this build, making it incompatible with Gradle 5.0.
Use '--warning-mode all' to show the individual deprecation warnings.
See Command-Line Interface - Gradle User Manual

BUILD FAILED in 17s
 
Краш-лог
C:\Users\kskul>cd C:\Minecraft Moding\Barotium Mod

C:\Minecraft Moding\Barotium Mod>gradlew setupDecompWorkspace
To honour the JVM settings for this build a new JVM will be forked. Please consider using the daemon: https://docs.gradle.org/4.9/userguide/gradle_daemon.html.
Daemon will be stopped at the end of the build stopping after processing

> Configure project :
New Dep: net.minecraftforge:forge:1.12.2-14.23.5.2854_mapped_snapshot_20171003-1.12

FAILURE: Build failed with an exception.

* What went wrong:
Task 'setupDecompWorkspace' not found in root project 'Barotium Mod'.

* Try:
Run gradlew tasks to get a list of available tasks. Run with --stacktrace option to get the stack trace. Run with --info or --debug option to get more log output. Run with --scan to get full insights.

* Get more help at https://help.gradle.org

Deprecated Gradle features were used in this build, making it incompatible with Gradle 5.0.
Use '--warning-mode all' to show the individual deprecation warnings.
See https://docs.gradle.org/4.9/userguide/command_line_interface.html#sec:command_line_warnings

BUILD FAILED in 17s
Краш-лог:
C:\Users\kskul>cd C:\Minecraft Moding\Barotium Mod

C:\Minecraft Moding\Barotium Mod>gradlew setupDecompWorkspace
To honour the JVM settings for this build a new JVM will be forked. Please consider using the daemon: https://docs.gradle.org/4.9/userguide/gradle_daemon.html.
Daemon will be stopped at the end of the build stopping after processing

> Configure project :
New Dep: net.minecraftforge:forge:1.12.2-14.23.5.2854_mapped_snapshot_20171003-1.12

FAILURE: Build failed with an exception.

* What went wrong:
Task 'setupDecompWorkspace' not found in root project 'Barotium Mod'.

* Try:
Run gradlew tasks to get a list of available tasks. Run with --stacktrace option to get the stack trace. Run with --info or --debug option to get more log output. Run with --scan to get full insights.

* Get more help at https://help.gradle.org

Deprecated Gradle features were used in this build, making it incompatible with Gradle 5.0.
Use '--warning-mode all' to show the individual deprecation warnings.
See https://docs.gradle.org/4.9/userguide/command_line_interface.html#sec:command_line_warnings

BUILD FAILED in 17s
Назад
Сверху