Ошибка сборки на стадии реобфускации (:reobf MALFORMED)

Версия Minecraft
1.7.10
172
4
21
В начале всё было хорошо, писал свой мод, он запускался. Потребовалось добавить ic2 dev как библиотеку из-за того, что нужен был прямой доступ к контенту. Всё работало, но когда я решил собрать мод - появилась ошибка реобфускации. Я не уверен, что это был ic2, но всё же: мне надо исключить .jar из реобфускации gradle.
 
Краш-лог
C:\Users\landex\Desktop\Сорцы\Java\MC\HydraCoreMod>gradlew build --stacktrace                                           #################################################                                                                                ForgeGradle 1.2-SNAPSHOT-fb514d3                                                                                 https://github.com/MinecraftForge/ForgeGradle                                                                         #################################################                                                                                      Powered by MCP unknown                                                                                                http://modcoderpack.com                                                                                             by: Searge, ProfMobius, Fesh0r,                                                                                         R4wk, ZeuX, IngisKahn, bspkrs                                                                                  #################################################                                                                       :compileApiJava UP-TO-DATE                                                                                              :processApiResources UP-TO-DATE                                                                                         :apiClasses UP-TO-DATE                                                                                                  :sourceMainJava UP-TO-DATE                                                                                              :compileJava UP-TO-DATE                                                                                                 :processResources UP-TO-DATE                                                                                            :classes UP-TO-DATE                                                                                                     :deobfJar UP-TO-DATE                                                                                                    :jar UP-TO-DATE                                                                                                         :compileTestJava UP-TO-DATE                                                                                             :processTestResources UP-TO-DATE                                                                                        :testClasses UP-TO-DATE                                                                                                 :test UP-TO-DATE                                                                                                        :extractMcpData UP-TO-DATE                                                                                              :getVersionJson                                                                                                         :extractUserDev UP-TO-DATE                                                                                              :genSrgs SKIPPED                                                                                                        :reobf FAILED                                                                                                                                                                                                                                   FAILURE: Build failed with an exception.                                                                                                                                                                                                        * What went wrong:                                                                                                      Execution failed for task ':reobf'.                                                                                     > MALFORMED                                                                                                                                                                                                                                     * Try:                                                                                                                  Run with --info or --debug option to get more log output.                                                                                                                                                                                       * Exception is:                                                                                                         org.gradle.api.tasks.TaskExecutionException: Execution failed for task ':reobf'.                                                at org.gradle.api.internal.tasks.execution.ExecuteActionsTaskExecuter.executeActions(ExecuteActionsTaskExecuter.java:69)                                                                                                                        at org.gradle.api.internal.tasks.execution.ExecuteActionsTaskExecuter.execute(ExecuteActionsTaskExecuter.java:46)                                                                                                                               at org.gradle.api.internal.tasks.execution.PostExecutionAnalysisTaskExecuter.execute(PostExecutionAnalysisTaskExecuter.java:35)                                                                                                                 at org.gradle.api.internal.tasks.execution.SkipUpToDateTaskExecuter.execute(SkipUpToDateTaskExecuter.java:64)           at org.gradle.api.internal.tasks.execution.ValidatingTaskExecuter.execute(ValidatingTaskExecuter.java:58)               at org.gradle.api.internal.tasks.execution.SkipEmptySourceFilesTaskExecuter.execute(SkipEmptySourceFilesTaskExecuter.java:52)                                                                                                                   at org.gradle.api.internal.tasks.execution.SkipTaskWithNoActionsExecuter.execute(SkipTaskWithNoActionsExecuter.java:52)                                                                                                                         at org.gradle.api.internal.tasks.execution.SkipOnlyIfTaskExecuter.execute(SkipOnlyIfTaskExecuter.java:53)               at org.gradle.api.internal.tasks.execution.ExecuteAtMostOnceTaskExecuter.execute(ExecuteAtMostOnceTaskExecuter.java:43)                                                                                                                         at org.gradle.execution.taskgraph.DefaultTaskGraphExecuter$EventFiringTaskWorker.execute(DefaultTaskGraphExecuter.java:203)                                                                                                                     at org.gradle.execution.taskgraph.DefaultTaskGraphExecuter$EventFiringTaskWorker.execute(DefaultTaskGraphExecuter.java:185)                                                                                                                     at org.gradle.execution.taskgraph.AbstractTaskPlanExecutor$TaskExecutorWorker.processTask(AbstractTaskPlanExecutor.java:62)                                                                                                                     at org.gradle.execution.taskgraph.AbstractTaskPlanExecutor$TaskExecutorWorker.run(AbstractTaskPlanExecutor.java:50)                                                                                                                             at org.gradle.execution.taskgraph.DefaultTaskPlanExecutor.process(DefaultTaskPlanExecutor.java:25)                      at org.gradle.execution.taskgraph.DefaultTaskGraphExecuter.execute(DefaultTaskGraphExecuter.java:110)                   at org.gradle.execution.SelectedTaskExecutionAction.execute(SelectedTaskExecutionAction.java:37)                        at org.gradle.execution.DefaultBuildExecuter.execute(DefaultBuildExecuter.java:37)                                      at org.gradle.execution.DefaultBuildExecuter.access$000(DefaultBuildExecuter.java:23)                                   at org.gradle.execution.DefaultBuildExecuter$1.proceed(DefaultBuildExecuter.java:43)                                    at org.gradle.execution.DryRunBuildExecutionAction.execute(DryRunBuildExecutionAction.java:32)                          at org.gradle.execution.DefaultBuildExecuter.execute(DefaultBuildExecuter.java:37)                                      at org.gradle.execution.DefaultBuildExecuter.execute(DefaultBuildExecuter.java:30)                                      at org.gradle.initialization.DefaultGradleLauncher$4.run(DefaultGradleLauncher.java:158)                                at org.gradle.internal.Factories$1.create(Factories.java:22)                                                            at org.gradle.internal.progress.DefaultBuildOperationExecutor.run(DefaultBuildOperationExecutor.java:90)                at org.gradle.internal.progress.DefaultBuildOperationExecutor.run(DefaultBuildOperationExecutor.java:52)                at org.gradle.initialization.DefaultGradleLauncher.doBuildStages(DefaultGradleLauncher.java:155)                        at org.gradle.initialization.DefaultGradleLauncher.access$200(DefaultGradleLauncher.java:36)                            at org.gradle.initialization.DefaultGradleLauncher$1.create(DefaultGradleLauncher.java:103)                             at org.gradle.initialization.DefaultGradleLauncher$1.create(DefaultGradleLauncher.java:97)                              at org.gradle.internal.progress.DefaultBuildOperationExecutor.run(DefaultBuildOperationExecutor.java:90)                at org.gradle.internal.progress.DefaultBuildOperationExecutor.run(DefaultBuildOperationExecutor.java:62)                at org.gradle.initialization.DefaultGradleLauncher.doBuild(DefaultGradleLauncher.java:97)                               at org.gradle.initialization.DefaultGradleLauncher.run(DefaultGradleLauncher.java:86)                                   at org.gradle.launcher.exec.InProcessBuildActionExecuter$DefaultBuildController.run(InProcessBuildActionExecuter.java:102)                                                                                                                      at org.gradle.tooling.internal.provider.ExecuteBuildActionRunner.run(ExecuteBuildActionRunner.java:28)                  at org.gradle.launcher.exec.ChainingBuildActionRunner.run(ChainingBuildActionRunner.java:35)                            at org.gradle.launcher.exec.InProcessBuildActionExecuter.execute(InProcessBuildActionExecuter.java:47)                  at org.gradle.launcher.exec.InProcessBuildActionExecuter.execute(InProcessBuildActionExecuter.java:32)                  at org.gradle.launcher.exec.ContinuousBuildActionExecuter.execute(ContinuousBuildActionExecuter.java:77)                at org.gradle.launcher.exec.ContinuousBuildActionExecuter.execute(ContinuousBuildActionExecuter.java:47)                at org.gradle.launcher.exec.DaemonUsageSuggestingBuildActionExecuter.execute(DaemonUsageSuggestingBuildActionExecuter.java:51)                                                                                                                  at org.gradle.launcher.exec.DaemonUsageSuggestingBuildActionExecuter.execute(DaemonUsageSuggestingBuildActionExecuter.java:28)                                                                                                                  at org.gradle.launcher.cli.RunBuildAction.run(RunBuildAction.java:43)                                                   at org.gradle.internal.Actions$RunnableActionAdapter.execute(Actions.java:170)                                          at org.gradle.launcher.cli.CommandLineActionFactory$ParseAndBuildAction.execute(CommandLineActionFactory.java:237)                                                                                                                              at org.gradle.launcher.cli.CommandLineActionFactory$ParseAndBuildAction.execute(CommandLineActionFactory.java:210)                                                                                                                              at org.gradle.launcher.cli.JavaRuntimeValidationAction.execute(JavaRuntimeValidationAction.java:35)                     at org.gradle.launcher.cli.JavaRuntimeValidationAction.execute(JavaRuntimeValidationAction.java:24)                     at org.gradle.launcher.cli.CommandLineActionFactory$WithLogging.execute(CommandLineActionFactory.java:206)              at org.gradle.launcher.cli.CommandLineActionFactory$WithLogging.execute(CommandLineActionFactory.java:169)              at org.gradle.launcher.cli.ExceptionReportingAction.execute(ExceptionReportingAction.java:33)                           at org.gradle.launcher.cli.ExceptionReportingAction.execute(ExceptionReportingAction.java:22)                           at org.gradle.launcher.Main.doAction(Main.java:33)                                                                      at org.gradle.launcher.bootstrap.EntryPoint.run(EntryPoint.java:45)                                                     at org.gradle.launcher.bootstrap.ProcessBootstrap.runNoExit(ProcessBootstrap.java:54)                                   at org.gradle.launcher.bootstrap.ProcessBootstrap.run(ProcessBootstrap.java:35)                                         at org.gradle.launcher.GradleMain.main(GradleMain.java:23)                                                              at org.gradle.wrapper.BootstrapMainStarter.start(BootstrapMainStarter.java:30)                                          at org.gradle.wrapper.WrapperExecutor.execute(WrapperExecutor.java:127)                                                 at org.gradle.wrapper.GradleWrapperMain.main(GradleWrapperMain.java:56)                                         Caused by: java.lang.IllegalArgumentException: MALFORMED                                                                        at net.md_5.specialsource.Jar.collectJarFiles(Jar.java:169)                                                             at net.md_5.specialsource.Jar.init(Jar.java:229)                                                                        at net.md_5.specialsource.Jar.init(Jar.java:206)                                                                        at net.minecraftforge.gradle.tasks.user.reobf.ObfArtifact.applySpecialSource(ObfArtifact.java:387)                      at net.minecraftforge.gradle.tasks.user.reobf.ObfArtifact.generate(ObfArtifact.java:350)                                at net.minecraftforge.gradle.tasks.user.reobf.ReobfTask.doTask(ReobfTask.java:317)                                      at org.gradle.internal.reflect.JavaMethod.invoke(JavaMethod.java:75)                                                    at org.gradle.api.internal.project.taskfactory.AnnotationProcessingTaskFactory$StandardTaskAction.doExecute(AnnotationProcessingTaskFactory.java:226)                                                                                           at org.gradle.api.internal.project.taskfactory.AnnotationProcessingTaskFactory$StandardTaskAction.execute(AnnotationProcessingTaskFactory.java:219)                                                                                             at org.gradle.api.internal.project.taskfactory.AnnotationProcessingTaskFactory$StandardTaskAction.execute(AnnotationProcessingTaskFactory.java:208)                                                                                             at org.gradle.api.internal.AbstractTask$TaskActionWrapper.execute(AbstractTask.java:585)                                at org.gradle.api.internal.AbstractTask$TaskActionWrapper.execute(AbstractTask.java:568)                                at org.gradle.api.internal.tasks.execution.ExecuteActionsTaskExecuter.executeAction(ExecuteActionsTaskExecuter.java:80)                                                                                                                         at org.gradle.api.internal.tasks.execution.ExecuteActionsTaskExecuter.executeActions(ExecuteActionsTaskExecuter.java:61)                                                                                                                        ... 60 more                                                                                                                                                                                                                                                                                                                                                     BUILD FAILED                                                                                                                                                                                                                                    Total time: 4.548 secs
Краш-лог:
C:\Users\landex\Desktop\Сорцы\Java\MC\HydraCoreMod>gradlew build --stacktrace                                           #################################################                                                                                ForgeGradle 1.2-SNAPSHOT-fb514d3                                                                                 https://github.com/MinecraftForge/ForgeGradle                                                                         #################################################                                                                                      Powered by MCP unknown                                                                                                http://modcoderpack.com                                                                                             by: Searge, ProfMobius, Fesh0r,                                                                                         R4wk, ZeuX, IngisKahn, bspkrs                                                                                  #################################################                                                                       :compileApiJava UP-TO-DATE                                                                                              :processApiResources UP-TO-DATE                                                                                         :apiClasses UP-TO-DATE                                                                                                  :sourceMainJava UP-TO-DATE                                                                                              :compileJava UP-TO-DATE                                                                                                 :processResources UP-TO-DATE                                                                                            :classes UP-TO-DATE                                                                                                     :deobfJar UP-TO-DATE                                                                                                    :jar UP-TO-DATE                                                                                                         :compileTestJava UP-TO-DATE                                                                                             :processTestResources UP-TO-DATE                                                                                        :testClasses UP-TO-DATE                                                                                                 :test UP-TO-DATE                                                                                                        :extractMcpData UP-TO-DATE                                                                                              :getVersionJson                                                                                                         :extractUserDev UP-TO-DATE                                                                                              :genSrgs SKIPPED                                                                                                        :reobf FAILED                                                                                                                                                                                                                                   FAILURE: Build failed with an exception.                                                                                                                                                                                                        * What went wrong:                                                                                                      Execution failed for task ':reobf'.                                                                                     > MALFORMED                                                                                                                                                                                                                                     * Try:                                                                                                                  Run with --info or --debug option to get more log output.                                                                                                                                                                                       * Exception is:                                                                                                         org.gradle.api.tasks.TaskExecutionException: Execution failed for task ':reobf'.                                                at org.gradle.api.internal.tasks.execution.ExecuteActionsTaskExecuter.executeActions(ExecuteActionsTaskExecuter.java:69)                                                                                                                        at org.gradle.api.internal.tasks.execution.ExecuteActionsTaskExecuter.execute(ExecuteActionsTaskExecuter.java:46)                                                                                                                               at org.gradle.api.internal.tasks.execution.PostExecutionAnalysisTaskExecuter.execute(PostExecutionAnalysisTaskExecuter.java:35)                                                                                                                 at org.gradle.api.internal.tasks.execution.SkipUpToDateTaskExecuter.execute(SkipUpToDateTaskExecuter.java:64)           at org.gradle.api.internal.tasks.execution.ValidatingTaskExecuter.execute(ValidatingTaskExecuter.java:58)               at org.gradle.api.internal.tasks.execution.SkipEmptySourceFilesTaskExecuter.execute(SkipEmptySourceFilesTaskExecuter.java:52)                                                                                                                   at org.gradle.api.internal.tasks.execution.SkipTaskWithNoActionsExecuter.execute(SkipTaskWithNoActionsExecuter.java:52)                                                                                                                         at org.gradle.api.internal.tasks.execution.SkipOnlyIfTaskExecuter.execute(SkipOnlyIfTaskExecuter.java:53)               at org.gradle.api.internal.tasks.execution.ExecuteAtMostOnceTaskExecuter.execute(ExecuteAtMostOnceTaskExecuter.java:43)                                                                                                                         at org.gradle.execution.taskgraph.DefaultTaskGraphExecuter$EventFiringTaskWorker.execute(DefaultTaskGraphExecuter.java:203)                                                                                                                     at org.gradle.execution.taskgraph.DefaultTaskGraphExecuter$EventFiringTaskWorker.execute(DefaultTaskGraphExecuter.java:185)                                                                                                                     at org.gradle.execution.taskgraph.AbstractTaskPlanExecutor$TaskExecutorWorker.processTask(AbstractTaskPlanExecutor.java:62)                                                                                                                     at org.gradle.execution.taskgraph.AbstractTaskPlanExecutor$TaskExecutorWorker.run(AbstractTaskPlanExecutor.java:50)                                                                                                                             at org.gradle.execution.taskgraph.DefaultTaskPlanExecutor.process(DefaultTaskPlanExecutor.java:25)                      at org.gradle.execution.taskgraph.DefaultTaskGraphExecuter.execute(DefaultTaskGraphExecuter.java:110)                   at org.gradle.execution.SelectedTaskExecutionAction.execute(SelectedTaskExecutionAction.java:37)                        at org.gradle.execution.DefaultBuildExecuter.execute(DefaultBuildExecuter.java:37)                                      at org.gradle.execution.DefaultBuildExecuter.access$000(DefaultBuildExecuter.java:23)                                   at org.gradle.execution.DefaultBuildExecuter$1.proceed(DefaultBuildExecuter.java:43)                                    at org.gradle.execution.DryRunBuildExecutionAction.execute(DryRunBuildExecutionAction.java:32)                          at org.gradle.execution.DefaultBuildExecuter.execute(DefaultBuildExecuter.java:37)                                      at org.gradle.execution.DefaultBuildExecuter.execute(DefaultBuildExecuter.java:30)                                      at org.gradle.initialization.DefaultGradleLauncher$4.run(DefaultGradleLauncher.java:158)                                at org.gradle.internal.Factories$1.create(Factories.java:22)                                                            at org.gradle.internal.progress.DefaultBuildOperationExecutor.run(DefaultBuildOperationExecutor.java:90)                at org.gradle.internal.progress.DefaultBuildOperationExecutor.run(DefaultBuildOperationExecutor.java:52)                at org.gradle.initialization.DefaultGradleLauncher.doBuildStages(DefaultGradleLauncher.java:155)                        at org.gradle.initialization.DefaultGradleLauncher.access$200(DefaultGradleLauncher.java:36)                            at org.gradle.initialization.DefaultGradleLauncher$1.create(DefaultGradleLauncher.java:103)                             at org.gradle.initialization.DefaultGradleLauncher$1.create(DefaultGradleLauncher.java:97)                              at org.gradle.internal.progress.DefaultBuildOperationExecutor.run(DefaultBuildOperationExecutor.java:90)                at org.gradle.internal.progress.DefaultBuildOperationExecutor.run(DefaultBuildOperationExecutor.java:62)                at org.gradle.initialization.DefaultGradleLauncher.doBuild(DefaultGradleLauncher.java:97)                               at org.gradle.initialization.DefaultGradleLauncher.run(DefaultGradleLauncher.java:86)                                   at org.gradle.launcher.exec.InProcessBuildActionExecuter$DefaultBuildController.run(InProcessBuildActionExecuter.java:102)                                                                                                                      at org.gradle.tooling.internal.provider.ExecuteBuildActionRunner.run(ExecuteBuildActionRunner.java:28)                  at org.gradle.launcher.exec.ChainingBuildActionRunner.run(ChainingBuildActionRunner.java:35)                            at org.gradle.launcher.exec.InProcessBuildActionExecuter.execute(InProcessBuildActionExecuter.java:47)                  at org.gradle.launcher.exec.InProcessBuildActionExecuter.execute(InProcessBuildActionExecuter.java:32)                  at org.gradle.launcher.exec.ContinuousBuildActionExecuter.execute(ContinuousBuildActionExecuter.java:77)                at org.gradle.launcher.exec.ContinuousBuildActionExecuter.execute(ContinuousBuildActionExecuter.java:47)                at org.gradle.launcher.exec.DaemonUsageSuggestingBuildActionExecuter.execute(DaemonUsageSuggestingBuildActionExecuter.java:51)                                                                                                                  at org.gradle.launcher.exec.DaemonUsageSuggestingBuildActionExecuter.execute(DaemonUsageSuggestingBuildActionExecuter.java:28)                                                                                                                  at org.gradle.launcher.cli.RunBuildAction.run(RunBuildAction.java:43)                                                   at org.gradle.internal.Actions$RunnableActionAdapter.execute(Actions.java:170)                                          at org.gradle.launcher.cli.CommandLineActionFactory$ParseAndBuildAction.execute(CommandLineActionFactory.java:237)                                                                                                                              at org.gradle.launcher.cli.CommandLineActionFactory$ParseAndBuildAction.execute(CommandLineActionFactory.java:210)                                                                                                                              at org.gradle.launcher.cli.JavaRuntimeValidationAction.execute(JavaRuntimeValidationAction.java:35)                     at org.gradle.launcher.cli.JavaRuntimeValidationAction.execute(JavaRuntimeValidationAction.java:24)                     at org.gradle.launcher.cli.CommandLineActionFactory$WithLogging.execute(CommandLineActionFactory.java:206)              at org.gradle.launcher.cli.CommandLineActionFactory$WithLogging.execute(CommandLineActionFactory.java:169)              at org.gradle.launcher.cli.ExceptionReportingAction.execute(ExceptionReportingAction.java:33)                           at org.gradle.launcher.cli.ExceptionReportingAction.execute(ExceptionReportingAction.java:22)                           at org.gradle.launcher.Main.doAction(Main.java:33)                                                                      at org.gradle.launcher.bootstrap.EntryPoint.run(EntryPoint.java:45)                                                     at org.gradle.launcher.bootstrap.ProcessBootstrap.runNoExit(ProcessBootstrap.java:54)                                   at org.gradle.launcher.bootstrap.ProcessBootstrap.run(ProcessBootstrap.java:35)                                         at org.gradle.launcher.GradleMain.main(GradleMain.java:23)                                                              at org.gradle.wrapper.BootstrapMainStarter.start(BootstrapMainStarter.java:30)                                          at org.gradle.wrapper.WrapperExecutor.execute(WrapperExecutor.java:127)                                                 at org.gradle.wrapper.GradleWrapperMain.main(GradleWrapperMain.java:56)                                         Caused by: java.lang.IllegalArgumentException: MALFORMED                                                                        at net.md_5.specialsource.Jar.collectJarFiles(Jar.java:169)                                                             at net.md_5.specialsource.Jar.init(Jar.java:229)                                                                        at net.md_5.specialsource.Jar.init(Jar.java:206)                                                                        at net.minecraftforge.gradle.tasks.user.reobf.ObfArtifact.applySpecialSource(ObfArtifact.java:387)                      at net.minecraftforge.gradle.tasks.user.reobf.ObfArtifact.generate(ObfArtifact.java:350)                                at net.minecraftforge.gradle.tasks.user.reobf.ReobfTask.doTask(ReobfTask.java:317)                                      at org.gradle.internal.reflect.JavaMethod.invoke(JavaMethod.java:75)                                                    at org.gradle.api.internal.project.taskfactory.AnnotationProcessingTaskFactory$StandardTaskAction.doExecute(AnnotationProcessingTaskFactory.java:226)                                                                                           at org.gradle.api.internal.project.taskfactory.AnnotationProcessingTaskFactory$StandardTaskAction.execute(AnnotationProcessingTaskFactory.java:219)                                                                                             at org.gradle.api.internal.project.taskfactory.AnnotationProcessingTaskFactory$StandardTaskAction.execute(AnnotationProcessingTaskFactory.java:208)                                                                                             at org.gradle.api.internal.AbstractTask$TaskActionWrapper.execute(AbstractTask.java:585)                                at org.gradle.api.internal.AbstractTask$TaskActionWrapper.execute(AbstractTask.java:568)                                at org.gradle.api.internal.tasks.execution.ExecuteActionsTaskExecuter.executeAction(ExecuteActionsTaskExecuter.java:80)                                                                                                                         at org.gradle.api.internal.tasks.execution.ExecuteActionsTaskExecuter.executeActions(ExecuteActionsTaskExecuter.java:61)                                                                                                                        ... 60 more                                                                                                                                                                                                                                                                                                                                                     BUILD FAILED                                                                                                                                                                                                                                    Total time: 4.548 secs
Решение
Чел, библиотеки не компилируются и не обфусцируются, они вообще не изменяются при сборке.
У тебя где-то в ресурсах ТВОЕГО МОДА русские названия есть и из-за этого крашится. Проверяй название файлов в assets.
но когда я решил собрать мод - появилась ошибка реобфускации.
сборка у меня проходит успешно
реобфускация выдаёт ошибку
what ? Там ты говоришь одно, тут другое... у тебя ic2 dev/deobf или обычный ?
 
Чел, библиотеки не компилируются и не обфусцируются, они вообще не изменяются при сборке.
У тебя где-то в ресурсах ТВОЕГО МОДА русские названия есть и из-за этого крашится. Проверяй название файлов в assets.
 
Назад
Сверху