18:18:30.685 [INFO] [org.gradle.api.internal.tasks.execution.SkipEmptySourceFile
sTaskExecuter ]
S
kipping task ':test' as it has no source files.
18:18:30.688 [DEBUG] [org.gradle.api.internal.tasks.execution.ExecuteAtMostOnceT
askExecuter ]
F
inished executing task ':test'
18:18:30.692 [LIFECYCLE] [class org.gradle.TaskExecutionLogger] :test UP-TO-DATE
18:18:30.697 [INFO] [org.gradle.execution.taskgraph.AbstractTaskPlanExecutor] :t
est (Thread[main,5,main]) completed. Took 0.031 secs.
18:18:30.700 [INFO] [org.gradle.execution.taskgraph.AbstractTaskPlanExecutor] :r
eobf (Thread[main,5,main]) started.
18:18:30.703 [LIFECYCLE] [class org.gradle.TaskExecutionLogger] :reobf
18:18:30.704 [DEBUG] [org.gradle.api.internal.tasks.execution.ExecuteAtMostOnceT
askExecuter ]
S
tarting to execute task ':reobf'
18:18:30.712 [DEBUG] [org.gradle.api.Project] Resolving: {MC_VERSION}
18:18:30.715 [DEBUG] [org.gradle.api.Project] Resolved: 1.7.2
18:18:30.718 [DEBUG] [org.gradle.api.internal.tasks.execution.SkipUpToDateTaskEx
ecuter ]
D
etermining if task ':reobf' is up-to-date
18:18:30.729 [INFO] [org.gradle.api.internal.tasks.execution.SkipUpToDateTaskExe
cuter ]
E
xecuting task ':reobf' (up-to-date check took 0.007 secs) due to:
Output file C:\Users\HOME\Desktop\Forger\build\libs\modid-1.0.jar has changed.
Output file C:\Users\HOME\Desktop\Forger\build\libs\modid-1.0.jar has changed.
18:18:30.733 [DEBUG] [org.gradle.api.internal.tasks.execution.ExecuteActionsTask
Executer ]
E
xecuting actions for task ':reobf'.
18:18:30.893 [DEBUG] [org.gradle.api.internal.tasks.execution.ExecuteAtMostOnceT
askExecuter ]
F
inished executing task ':reobf'
18:18:30.957 [LIFECYCLE] [class org.gradle.TaskExecutionLogger] :reobf FAILED
18:18:30.961 [INFO] [org.gradle.execution.taskgraph.AbstractTaskPlanExecutor] :r
eobf (Thread[main,5,main]) completed. Took 0.258 secs.
18:18:30.964 [DEBUG] [org.gradle.execution.taskgraph.AbstractTaskPlanExecutor] T
ask worker [Thread[main,5,main]] finished, busy: 8.987 secs, idle: 0.206 secs
18:18:30.970 [ERROR] [org.gradle.BuildExceptionReporter]
18:18:30.975 [ERROR] [org.gradle.BuildExceptionReporter] FAILURE: Build failed w
ith an exception.
18:18:30.989 [ERROR] [org.gradle.BuildExceptionReporter]
18:18:30.992 [ERROR] [org.gradle.BuildExceptionReporter] * What went wrong:
18:18:30.995 [ERROR] [org.gradle.BuildExceptionReporter] Execution failed for ta
sk ':reobf'.
18:18:30.997 [ERROR] [org.gradle.BuildExceptionReporter] > MALFORMED
18:18:31.002 [ERROR] [org.gradle.BuildExceptionReporter]
18:18:31.004 [ERROR] [org.gradle.BuildExceptionReporter] * Exception is:
18:18:31.008 [ERROR] [org.gradle.BuildExceptionReporter] org.gradle.api.tasks.Ta
skExecutionException: Execution failed for task ':reobf'.
18:18:31.010 [ERROR] [org.gradle.BuildExceptionReporter] at org.gradle.ap
i.internal.tasks.execution.ExecuteActionsTaskExecuter.executeActions(ExecuteActi
onsTaskExecuter.java:69)
18:18:31.013 [ERROR] [org.gradle.BuildExceptionReporter] at org.gradle.ap
i.internal.tasks.execution.ExecuteActionsTaskExecuter.execute(ExecuteActionsTask
Executer.java:46)
18:18:31.015 [ERROR] [org.gradle.BuildExceptionReporter] at org.gradle.ap
i.internal.tasks.execution.PostExecutionAnalysisTaskExecuter.execute(PostExecuti
onAnalysisTaskExecuter.java:35)
18:18:31.018 [ERROR] [org.gradle.BuildExceptionReporter] at org.gradle.ap
i.internal.tasks.execution.SkipUpToDateTaskExecuter.execute(SkipUpToDateTaskExec
uter.java:64)
18:18:31.022 [ERROR] [org.gradle.BuildExceptionReporter] at org.gradle.ap
i.internal.tasks.execution.ValidatingTaskExecuter.execute(ValidatingTaskExecuter
.java:58)
18:18:31.025 [ERROR] [org.gradle.BuildExceptionReporter] at org.gradle.ap
i.internal.tasks.execution.SkipEmptySourceFilesTaskExecuter.execute(SkipEmptySou
rceFilesTaskExecuter.java:42)
18:18:31.027 [ERROR] [org.gradle.BuildExceptionReporter] at org.gradle.ap
i.internal.tasks.execution.SkipTaskWithNoActionsExecuter.execute(SkipTaskWithNoA
ctionsExecuter.java:52)
18:18:31.030 [ERROR] [org.gradle.BuildExceptionReporter] at org.gradle.ap
i.internal.tasks.execution.SkipOnlyIfTaskExecuter.execute(SkipOnlyIfTaskExecuter
.java:53)
18:18:31.032 [ERROR] [org.gradle.BuildExceptionReporter] at org.gradle.ap
i.internal.tasks.execution.ExecuteAtMostOnceTaskExecuter.execute(ExecuteAtMostOn
ceTaskExecuter.java:43)
18:18:31.035 [ERROR] [org.gradle.BuildExceptionReporter] at org.gradle.ap
i.internal.AbstractTask.executeWithoutThrowingTaskFailure(AbstractTask.java:289)
18:18:31.038 [ERROR] [org.gradle.BuildExceptionReporter] at org.gradle.ex
ecution.taskgraph.AbstractTaskPlanExecutor$TaskExecutorWorker.executeTask(Abstra
ctTaskPlanExecutor.java:79)
18:18:31.041 [ERROR] [org.gradle.BuildExceptionReporter] at org.gradle.ex
ecution.taskgraph.AbstractTaskPlanExecutor$TaskExecutorWorker.processTask(Abstra
ctTaskPlanExecutor.java:63)
18:18:31.043 [ERROR] [org.gradle.BuildExceptionReporter] at org.gradle.ex
ecution.taskgraph.AbstractTaskPlanExecutor$TaskExecutorWorker.run(AbstractTaskPl
anExecutor.java:51)
18:18:31.047 [ERROR] [org.gradle.BuildExceptionReporter] at org.gradle.ex
ecution.taskgraph.DefaultTaskPlanExecutor.process(DefaultTaskPlanExecutor.java:2
3)
18:18:31.049 [ERROR] [org.gradle.BuildExceptionReporter] at org.gradle.ex
ecution.taskgraph.DefaultTaskGraphExecuter.execute(DefaultTaskGraphExecuter.java
:86)
18:18:31.052 [ERROR] [org.gradle.BuildExceptionReporter] at org.gradle.ex
ecution.SelectedTaskExecutionAction.execute(SelectedTaskExecutionAction.java:29)
18:18:31.054 [ERROR] [org.gradle.BuildExceptionReporter] at org.gradle.ex
ecution.DefaultBuildExecuter.execute(DefaultBuildExecuter.java:61)
18:18:31.057 [ERROR] [org.gradle.BuildExceptionReporter] at org.gradle.ex
ecution.DefaultBuildExecuter.access$200(DefaultBuildExecuter.java:23)
18:18:31.060 [ERROR] [org.gradle.BuildExceptionReporter] at org.gradle.ex
ecution.DefaultBuildExecuter$2.proceed(DefaultBuildExecuter.java:67)
18:18:31.062 [ERROR] [org.gradle.BuildExceptionReporter] at org.gradle.ex
ecution.DryRunBuildExecutionAction.execute(DryRunBuildExecutionAction.java:32)
18:18:31.065 [ERROR] [org.gradle.BuildExceptionReporter] at org.gradle.ex
ecution.DefaultBuildExecuter.execute(DefaultBuildExecuter.java:61)
18:18:31.068 [ERROR] [org.gradle.BuildExceptionReporter] at org.gradle.ex
ecution.DefaultBuildExecuter.execute(DefaultBuildExecuter.java:54)
18:18:31.070 [ERROR] [org.gradle.BuildExceptionReporter] at org.gradle.in
itialization.DefaultGradleLauncher.doBuildStages(DefaultGradleLauncher.java:166)
18:18:31.076 [ERROR] [org.gradle.BuildExceptionReporter] at org.gradle.in
itialization.DefaultGradleLauncher.doBuild(DefaultGradleLauncher.java:113)
18:18:31.079 [ERROR] [org.gradle.BuildExceptionReporter] at org.gradle.in
itialization.DefaultGradleLauncher.run(DefaultGradleLauncher.java:81)
18:18:31.082 [ERROR] [org.gradle.BuildExceptionReporter] at org.gradle.la
uncher.exec.InProcessBuildActionExecuter$DefaultBuildController.run(InProcessBui
ldActionExecuter.java:64)
18:18:31.085 [ERROR] [org.gradle.BuildExceptionReporter] at org.gradle.la
uncher.cli.ExecuteBuildAction.run(ExecuteBuildAction.java:33)
18:18:31.087 [ERROR] [org.gradle.BuildExceptionReporter] at org.gradle.la
uncher.cli.ExecuteBuildAction.run(ExecuteBuildAction.java:24)
18:18:31.091 [ERROR] [org.gradle.BuildExceptionReporter] at org.gradle.la
uncher.exec.InProcessBuildActionExecuter.execute(InProcessBuildActionExecuter.ja
va:35)
18:18:31.095 [ERROR] [org.gradle.BuildExceptionReporter] at org.gradle.la
uncher.exec.InProcessBuildActionExecuter.execute(InProcessBuildActionExecuter.ja
va:26)
18:18:31.097 [ERROR] [org.gradle.BuildExceptionReporter] at org.gradle.la
uncher.cli.RunBuildAction.run(RunBuildAction.java:50)
18:18:31.100 [ERROR] [org.gradle.BuildExceptionReporter] at org.gradle.in
ternal.Actions$RunnableActionAdapter.execute(Actions.java:171)
18:18:31.103 [ERROR] [org.gradle.BuildExceptionReporter] at org.gradle.la
uncher.cli.CommandLineActionFactory$ParseAndBuildAction.execute(CommandLineActio
nFactory.java:201)
18:18:31.109 [ERROR] [org.gradle.BuildExceptionReporter] at org.gradle.la
uncher.cli.CommandLineActionFactory$ParseAndBuildAction.execute(CommandLineActio
nFactory.java:174)
18:18:31.112 [ERROR] [org.gradle.BuildExceptionReporter] at org.gradle.la
uncher.cli.CommandLineActionFactory$WithLogging.execute(CommandLineActionFactory
.java:170)
18:18:31.114 [ERROR] [org.gradle.BuildExceptionReporter] at org.gradle.la
uncher.cli.CommandLineActionFactory$WithLogging.execute(CommandLineActionFactory
.java:139)
18:18:31.117 [ERROR] [org.gradle.BuildExceptionReporter] at org.gradle.la
uncher.cli.ExceptionReportingAction.execute(ExceptionReportingAction.java:33)
18:18:31.120 [ERROR] [org.gradle.BuildExceptionReporter] at org.gradle.la
uncher.cli.ExceptionReportingAction.execute(ExceptionReportingAction.java:22)
18:18:31.125 [ERROR] [org.gradle.BuildExceptionReporter] at org.gradle.la
uncher.Main.doAction(Main.java:46)
18:18:31.127 [ERROR] [org.gradle.BuildExceptionReporter] at org.gradle.la
uncher.bootstrap.EntryPoint.run(EntryPoint.java:45)
18:18:31.130 [ERROR] [org.gradle.BuildExceptionReporter] at org.gradle.la
uncher.Main.main(Main.java:37)
18:18:31.133 [ERROR] [org.gradle.BuildExceptionReporter] at org.gradle.la
uncher.bootstrap.ProcessBootstrap.runNoExit(ProcessBootstrap.java:50)
18:18:31.135 [ERROR] [org.gradle.BuildExceptionReporter] at org.gradle.la
uncher.bootstrap.ProcessBootstrap.run(ProcessBootstrap.java:32)
18:18:31.138 [ERROR] [org.gradle.BuildExceptionReporter] at org.gradle.la
uncher.GradleMain.main(GradleMain.java:23)
18:18:31.142 [ERROR] [org.gradle.BuildExceptionReporter] at org.gradle.wr
apper.BootstrapMainStarter.start(BootstrapMainStarter.java:30)
18:18:31.145 [ERROR] [org.gradle.BuildExceptionReporter] at org.gradle.wr
apper.WrapperExecutor.execute(WrapperExecutor.java:127)
18:18:31.148 [ERROR] [org.gradle.BuildExceptionReporter] at org.gradle.wr
apper.GradleWrapperMain.main(GradleWrapperMain.java:55)
18:18:31.150 [ERROR] [org.gradle.BuildExceptionReporter] Caused by: java.lang.Il
legalArgumentException: MALFORMED
18:18:31.153 [ERROR] [org.gradle.BuildExceptionReporter] at net.md_5.spec
ialsource.Jar.collectJarFiles(Jar.java:169)
18:18:31.158 [ERROR] [org.gradle.BuildExceptionReporter] at net.md_5.spec
ialsource.Jar.init(Jar.java:229)
18:18:31.161 [ERROR] [org.gradle.BuildExceptionReporter] at net.md_5.spec
ialsource.Jar.init(Jar.java:206)
18:18:31.163 [ERROR] [org.gradle.BuildExceptionReporter] at net.minecraft
forge.gradle.tasks.user.reobf.ObfArtifact.applySpecialSource(ObfArtifact.java:38
7)
18:18:31.165 [ERROR] [org.gradle.BuildExceptionReporter] at net.minecraft
forge.gradle.tasks.user.reobf.ObfArtifact.generate(ObfArtifact.java:350)
18:18:31.169 [ERROR] [org.gradle.BuildExceptionReporter] at net.minecraft
forge.gradle.tasks.user.reobf.ReobfTask.doTask(ReobfTask.java:317)
18:18:31.172 [ERROR] [org.gradle.BuildExceptionReporter] at org.gradle.in
ternal.reflect.JavaMethod.invoke(JavaMethod.java:63)
18:18:31.177 [ERROR] [org.gradle.BuildExceptionReporter] at org.gradle.ap
i.internal.project.taskfactory.AnnotationProcessingTaskFactory$StandardTaskActio
n.doExecute(AnnotationProcessingTaskFactory.java:219)
18:18:31.182 [ERROR] [org.gradle.BuildExceptionReporter] at org.gradle.ap
i.internal.project.taskfactory.AnnotationProcessingTaskFactory$StandardTaskActio
n.execute(AnnotationProcessingTaskFactory.java:212)
18:18:31.185 [ERROR] [org.gradle.BuildExceptionReporter] at org.gradle.ap
i.internal.project.taskfactory.AnnotationProcessingTaskFactory$StandardTaskActio
n.execute(AnnotationProcessingTaskFactory.java:201)
18:18:31.187 [ERROR] [org.gradle.BuildExceptionReporter] at org.gradle.ap
i.internal.AbstractTask$TaskActionWrapper.execute(AbstractTask.java:533)
18:18:31.192 [ERROR] [org.gradle.BuildExceptionReporter] at org.gradle.ap
i.internal.AbstractTask$TaskActionWrapper.execute(AbstractTask.java:516)
18:18:31.195 [ERROR] [org.gradle.BuildExceptionReporter] at org.gradle.ap
i.internal.tasks.execution.ExecuteActionsTaskExecuter.executeAction(ExecuteActio
nsTaskExecuter.java:80)
18:18:31.197 [ERROR] [org.gradle.BuildExceptionReporter] at org.gradle.ap
i.internal.tasks.execution.ExecuteActionsTaskExecuter.executeActions(ExecuteActi
onsTaskExecuter.java:61)
18:18:31.200 [ERROR] [org.gradle.BuildExceptionReporter] ... 46 more
18:18:31.258 [ERROR] [org.gradle.BuildExceptionReporter]
18:18:31.262 [LIFECYCLE] [org.gradle.BuildResultLogger]
18:18:31.265 [LIFECYCLE] [org.gradle.BuildResultLogger] BUILD FAILED
18:18:31.268 [LIFECYCLE] [org.gradle.BuildResultLogger]
18:18:31.270 [LIFECYCLE] [org.gradle.BuildResultLogger] Total time: 21.419 secs
18:18:31.276 [DEBUG] [org.gradle.api.internal.tasks.compile.daemon.CompilerDaemo
nManager ]
S
topping 0 compiler daemon(s).
18:18:31.279 [INFO] [org.gradle.api.internal.tasks.compile.daemon.CompilerDaemon
Manager ]
S
topped 0 compiler daemon(s).
18:18:31.284 [DEBUG] [org.gradle.cache.internal.DefaultFileLockManager] Releasin
g lock on buildscript class cache for build file 'C:\Users\HOME\Desktop\Forger\b
uild.gradle' (C:\Users\HOME\.gradle\caches\1.12\scripts\build_5t90gjmcv6k02ob8cp