Проблемы компиляции

Статус
В этой теме нельзя размещать новые ответы.
96
2
Компилятор не компилирует последние 35 процентов мода. Ошибок Eclipse не выдаёт. Если надо то могу скинуть файлы мода.
 
2. Лог какой?
1. Какая версия Minecraft на котором писал этот код?
 
версия 1.7.2
лог? окно компиляции сразуже закрывается в случае ошибки или окончания процесса компиляции.
[merge_posts_bbcode]Добавлено: 27.10.2015 19:33:36[/merge_posts_bbcode]

компиляция даёт сбой на 84-ом проценте.
 
T-Rex написал(а):
версия 1.7.2
лог? окно компиляции сразуже закрывается в случае ошибки или окончания процесса компиляции.
[merge_posts_bbcode]Добавлено: 27.10.2015 19:33:36[/merge_posts_bbcode]

компиляция даёт сбой на 84-ом проценте.
Краш-лог сохраняется в отдельном файле в папке log ( из названия файла следует время и дата) .
 
нашёл grable.log. Вот:
Код:
The assetDir is deprecated!  I actually just did all this generalizing stuff just now.. Use runDir instead! runDir set to eclipse/assets/..The assetDir is deprecated!  I actually just did all this generalizing stuff just now.. Use runDir instead! runDir set to eclipse/assets/..

The runDir should be the location where you want MC to be run, usually he parent of the asset dirThe runDir should be the location where you want MC to be run, usually he parent of the asset dir

****************************
 Powered By MCP:             
 http://modcoderpack.com/    
 Searge, ProfMobius, Fesh0r, 
 R4wk, ZeuX, IngisKahn, bspkrs
 MCP Data version : unknown
****************************
:downloadClient SKIPPED
:downloadServer SKIPPED
:getVersionJson
:extractUserDev UP-TO-DATE
:mergeJars SKIPPED
:applyBinPatches SKIPPED
:downloadMcpTools SKIPPED
:extractMcpData UP-TO-DATE
:genSrgs SKIPPED
:deobfBinJar SKIPPED
:compileApiJava UP-TO-DATE
:processApiResources UP-TO-DATE
:apiClasses UP-TO-DATE
:sourceMainJava UP-TO-DATE
:compileJava UP-TO-DATE
:processResources UP-TO-DATE
:classes UP-TO-DATE
:jar UP-TO-DATE
:compileTestJava UP-TO-DATE
:processTestResources UP-TO-DATE
:testClasses UP-TO-DATE
:test UP-TO-DATE
:reobf FAILED

FAILURE: Build failed with an exception.

* What went wrong:
Execution failed for task ':reobf'.
> MALFORMED

* Try:
Run with --stacktrace option to get the stack trace. Run with --info or --debug option to get more log output.

BUILD FAILED
 
Попробуй-ка в assets найти текстуру\папку\файл с русским названием.
 
нашёл сразу лишьние 4 текстуры с кирилицей
[merge_posts_bbcode]Добавлено: 28.10.2015 20:34:27[/merge_posts_bbcode]

Тему ф топку. Спасибо, Develance
 
Статус
В этой теме нельзя размещать новые ответы.
Назад
Сверху